{"text_format":"1","workbook":"xlsx","n_sheets":2,"sheets":["Kuntakortti","Luvut"],"not_rendered":{"charts":0,"images":0,"macros":1,"external_links":0,"defined_names":2,"comments":0,"pivot_tables":0},"unopened":[],"bounds":{"document_bytes":16777216,"sheet_cells":100000,"rows_first":2000,"rows_last":500,"rows_between":2000,"halvings":0,"cell_chars":16384,"cell_head_chars":4096},"cells_cut":0,"cells_raw":0,"read":"whole","date_system":"1900"}

{"sheet":"Kuntakortti","index":0,"n_rows":79,"n_cols":16,"rows_kept":79,"cut":false,"hidden":false,"merged":[[1,6,1,7]]}
["Valtiovarainministeriö/Kunta- ja aluehallinto-osasto,14.12.2016"]
["KUNTIEN LOPULLISET TILINPÄÄTÖKSET 2013-2015",null,null,null,null,null,"Valitse kunta valikosta:"]
[null,null,null,null,null,null,null," "]
[{"$f":"INDEX(Luvut!$B$3:'Luvut'!$B$304,$A$7)","v":"KOKO MAA (Manner-Suomi)"},null,null,2013,null,null,2014,null,null,2015]
[]
["Asukasluku",null,null,{"$f":"VLOOKUP($A$4,Luvut!$B$3:$AT$304,2)","v":5422604},null,null,{"$f":"VLOOKUP($A$4,Luvut!$B$3:$ED$304,46)","v":5442837}," ",{"$f":"((G6/D6)-1)*100","v":0.37312331861223402},{"$f":"VLOOKUP($A$4,Luvut!$B$3:$ED$304,90)","v":5458325}," ",{"$f":"((J6/G6)-1)*100","v":0.28455748353295451}]
[99,null,null," "]
["Tunnuslukuja",null,null," "]
[null,null,null," "," "," "," ",null,"muut.%"," ",null,"muut.%",null,"Konsernivelka","Konsernivelka","Konsernivelka"]
["Lainat, euro/as",null,null,{"$f":"E67","v":2542.4762715477655}," ",null,{"$f":"H67","v":2696.5986672024169},null,{"$f":"((G10/D10)-1)*100","v":6.0619010442456434},{"$f":"K67","v":2840.5019854992147},null,{"$f":"((J10/G10)-1)*100","v":5.3364751695175405},null,"2013, milj. €","2014, milj. €","2015, milj. €"]
["Konsernilainat, euro/as",null,null,{"$f":"VLOOKUP($A$4,Luvut!$B$3:$FM$304,167)","v":5547.3457032820397},null,null,{"$f":"VLOOKUP($A$4,Luvut!$B$3:$FM$304,168)","v":5774},null,{"$f":"((G11/D11)-1)*100","v":4.0858152500548472},{"$f":"VLOOKUP($A$4,Luvut!$B$3:$FN$304,169)","v":5987},null,{"$f":"((J11/G11)-1)*100","v":3.6889504676134388},null,{"$f":"D11*D6","v":30081059000},{"$f":"G11*G6","v":31426940838},{"$f":"J11*J6","v":32678991775}]
["Lainanhoitokate",null,null,{"$f":"VLOOKUP($A$4,Luvut!$B$3:$AT$304,4)","v":1.319371239384578}," ",null,{"$f":"VLOOKUP($A$4,Luvut!$B$3:$ED$304,48)","v":1.2},null,null,{"$f":"VLOOKUP($A$4,Luvut!$B$3:$ED$304,92)","v":1.06}]
["Suhteellinen velkaantuneisuus, %",null,null,{"$f":"VLOOKUP($A$4,Luvut!$B$3:$AT$304,5)","v":50.716413855121289}," ",null,{"$f":"VLOOKUP($A$4,Luvut!$B$3:$ED$304,49)","v":52},null,null,{"$f":"VLOOKUP($A$4,Luvut!$B$3:$ED$304,93)","v":54.9}]
["Rahoitusvarallisuus, euro/as",null,null,{"$f":"VLOOKUP($A$4,Luvut!$B$3:$AT$304,6)","v":-2246.5641968323707}," ",null,{"$f":"VLOOKUP($A$4,Luvut!$B$3:$ED$304,50)","v":-2415},null,null,{"$f":"VLOOKUP($A$4,Luvut!$B$3:$ED$304,94)","v":-2611.6389185327002}]
["Omavaraisuusaste, %",null,null,{"$f":"VLOOKUP($A$4,Luvut!$B$3:$AT$304,10)","v":60.441079740347405},null,null,{"$f":"VLOOKUP($A$4,Luvut!$B$3:$ED$304,54)","v":61},null,null,{"$f":"VLOOKUP($A$4,Luvut!$B$3:$ED$304,98)","v":0}]
{"$rows_left_out":65}
{"sheet":"Luvut","index":1,"n_rows":304,"n_cols":179,"rows_kept":304,"cut":false,"hidden":false,"merged":[]}
[null,null,2013,"hakee muualta",92,93,94,"vanha",96,97,98,99,100,101,102,103,104,105,106,107,108,"summana",110,111,112,113,114,115,116,117,118,119,120,121,122,"kaavasta",124,125,126,127,128,129,130,131,"kaavasta",133,2014,"hakee muualta",92,93,94,"vanha",96,97,98,99,100,101,102,103,104,105,106,107,108,"summana",110,111,112,113,114,115,116,117,118,119,120,121,122,"kaavasta",124,125,126,127,128,129,130,131,"kaavasta",133,2015,"hakee muualta",92,93,94,"vanha",96,97,98,99,100,101,102,103,104,105,106,107,108,"summana",110,111,112,113,114,115,116,117,118,119,120,121,122,"kaavasta",124,125,126,127,128,129,130,131,"kaavasta",133,"Erillistiedot",135,136,137,138,139,2013,144,145,2014,147,148,2015,147,148,2013,152,2014,154,2015,null,2013,160,161,162,2014,164,165,166,2015,164,165,166,2013,2014,2015,"Yhden vero%:n","Yhden vero%:n",null,null,"Nettoinv."]
["Kunta nro","Kunta","Asukasluku ","Lainat e/asukas","Lainanhoitokate","Suhteellinen velkaantuneisuus-%","Rahoitusvarallisuus, e/as","Vuosikate","Suunnitelman mukaiset poistot","Tilikauden tulos","Omavaraisuusaste, %","Rahavarat e/as","Kassan riittävyys, pv","Kassasta maksut, €/as","Henkilöstökulut","Toimintatuotot","Toimintakulut","Toimintakate","Verotulot","Valtionosuudet","Alv-takaisinperintä","Käyttökate","Korkotuotot/-menot, netto","Muut rahoitustuotot/-menot, netto (sis Osinkotuotot)","Vuosikate","Suunnitelman mukaiset poistot ja arvonalet","Satunnaiset tuotot","Satunnaiset kulut","Tilikauden tulos","Poistoeron lisäys(-) tai vähennys(+)","Varausten lisäys(-) tai vähennys(+)","Rahastojen lisäys(-) tai vähennys(+)","Tilikauden yli- tai alijäämä","Kumulat yli/alij","Tulorah (toiminnan rahavirta)","Investoinnit, netto","Saamisten muutos (ent Pitkäaikaisten saamisten muutokset, netto)","Pitkäaikaisten lainojen vähennys","Toim ja inv rahavirta","Verotulot","Kunnallisvero","Osuus yhteisöveron tuotosta","Kiinteistövero","Tuloveroprosentti 2013","Yhden veroprosentin tuotto 2012","Sijoitus vuosikatteen mukaan","Asukasluku ","Lainat e/asukas","Lainanhoitokate","Suhteellinen velkaantuneisuus-%","Rahoitusvarallisuus, e/as","Vuosikate","Suunnitelman mukaiset poistot","Tilikauden tulos","Omavaraisuusaste, %","Rahavarat e/as","Kassan riittävyys, pv","Kassasta maksut, €/as","Henkilöstökulut","Toimintatuotot","Toimintakulut","Toimintakate","Verotulot","Valtionosuudet","Alv-takaisinperintä","Käyttökate","Korkotuotot/-menot, netto","Muut rahoitustuotot/-menot, netto (sis Osinkotuotot)","Vuosikate","Suunnitelman mukaiset poistot ja arvonalet","Satu. tuotot","Satu. kulut","Tilikauden tulos","Poistoeron lisäys(-) tai vähennys(+)","Varausten lisäys(-) tai vähennys(+)","Rahastojen lisäys(-) tai vähennys(+)","Tilikauden yli- tai alijäämä","Kumulat yli/alij","Tulorah (toiminnan rahavirta)","Investoinnit, netto","Saamisten muutos (ent Pitkäaikaisten saamisten muutokset, netto)","Pitkäaikaisten lainojen vähennys","Toim ja inv rahavirta","Verotulot","Kunnallisvero","Osuus yhteisöveron tuotosta","Kiinteistövero","Tuloveroprosentti 2014","Yhden veroprosentin tuotto 2013","Sijoitus vuosikatteen mukaan","Asukasluku","Lainat e/asukas","Lainanhoitokate","Suhteellinen velkaantuneisuus-%","Rahoitusvarallisuus, e/as","Vuosikate","Suunnitelman mukaiset poistot","Tilikauden tulos","Omavaraisuusaste, %","Rahavarat e/as","Kassan riittävyys, pv","Kassasta maksut, €/as","Henkilöstökulut","Toimintatuotot","Toimintakulut","Toimintakate","Verotulot","Valtionosuudet","Alv-takaisinperintä","Käyttökate","Korkotuotot/-menot, netto","Muut rahoitustuotot/-menot, netto (sis Osinkotuotot)","Vuosikate","Suunnitelman mukaiset poistot ja arvonalet","Satu. tuotot","Satu. kulut","Tilikauden tulos","Poistoeron lisäys(-) tai vähennys(+)","Varausten lisäys(-) tai vähennys(+)","Rahastojen lisäys(-) tai vähennys(+)","Tilikauden yli- tai alijäämä","Kumulat yli/alij","Tulorah (toiminnan rahavirta)","Investoinnit, netto","Saamisten muutos (ent Pitkäaikaisten saamisten muutokset, netto)","Pitkäaikaisten lainojen vähennys","Toim ja inv rahavirta","Verotulot","Kunnallisvero","Osuus yhteisöveron tuotosta","Kiinteistövero","Tuloveroprosentti 2015","Yhden veroprosentin tuotto 2006","Sijoitus vuosikatteen mukaan","Palvelujen ostot 2013","Palvelujen ostot 2014","Palvelujen ostot 2015","Harkvar2013","Harkvar2014","Harkvar2015"," - Investointimenot"," + Rahoitusos. investointimenoihin"," + Investointihyödykk. luovutustulot"," - Investointimenot"," + Rahoitusosuudet investointimenoihin"," + Investointihyödykkeiden luovutustulot"," - Investointimenot"," + Rahoitusosuudet investointimenoihin"," + Investointihyödykkeiden luovutustulot","Pitkäaikaisten lainojen lisäys"," ± Lyhytaikaisten lainojen muutos","Pitkäaikaisten lainojen lisäys"," ± Lyhytaikaisten lainojen muutos","Pitkäaikaisten lainojen lisäys"," ± Lyhytaikaisten lainojen muutos","Lainakanta","josta pitkäaik","josta lyhytaik","Lainasaamiset","Lainakanta","josta pitkäaik","josta lyhytaik","Lainasaamiset","Lainakanta","josta pitkäaik","josta lyhytaik","Lainasaamiset","Konsernilainat €/as","Konsernilainat €/as","Konsernilainat €/as","tuotto","tuotto, €/as",null,null,2015]
[20,"Akaa",17108,null,0.60431763285024154,48.72661510503999,-2688.0991349076457,null,null,null,37.011654906557858,98.550385784428329,4.9360722535934292,7287.350946925415,49369,24589,110499,-85910,57109,32218,null,null,-295,175,3297,3330,null,null,-33,34,null,null,1,-207,2267,null,722,-5918,-3328,57109,52871,1415,2823,20.5,null,205,17052,null,-8.7525844245348039E-2,59.775833887162541,-3520.9359605911332,null,null,null,29.320831221490117,47.091250293220732,2.1911187530370424,7844.5343654703265,48569,22820,112573,-89753,57963,30594,null,null,-292,184,-1304,3763,null,null,-5067,32,null,null,-5035,-5243,-1711,null,2115,-6586,-14048,57963,53091,1707,3165,21,null,300,17043,null,0.24972421400992831,66,-3907.1759666725343,null,null,null,25,117.46758199847444,5.5798379645537919,7684.0345009681396,47398,22841,110377,-87536,59092,29881,null,null,-218,40,1229,4203,0,0,-2974,31,0,0,-2943,-8186,758,null,790,-12000,-6593,{"$f":"DC3","v":59092},54123,1775,3194,21.25,null,277,45394,48004,47031,1540,null,null,-7548,715,1238,-13964,1161,466,-8431,341,739,7509,null,10311,7580,6670,2418,40898,34511,6387,7333,52203,38354,13849,7333,59953,43679,16274,7333,3045.358896422726,3704.8440065681448,4111,{"$f":"(DY3/EB3)","v":2546.964705882353},{"$f":"(FO3/CM3)*1000","v":149.44344926845937},null,null,-7467,null,null,4670,{"$f":"FV3*-1","v":-4670}]
[5,"Alajärvi",10227,null,0.15189873417721519,38.195341250036414,-3121.3454581011047,null,null,null,35.748268496342803,360.5162804341449,11.659331329111181,11286.105407255303,42843,42459,101988,-59529,27942,32588,null,null,-345,-426,230,2584,null,null,-2354,null,null,null,-2354,-4125,92,null,1282,-3513,-7384,27942,24456,1637,1849,21,null,268,10171,null,0.80636604774535814,36.457513579915158,-3052.6005309212464,null,null,null,36.733583860759495,294.26801691082488,10.107650743423914,10626.388752335071,42751,43017,100641,-57624,28360,32821,null,null,-363,78,3272,3076,null,null,196,null,null,null,196,-3929,3239,null,-7,-4148,814,28360,24370,1764,2226,21,null,172,10006,null,1.1717791411042944,33,-2771.6370177893264,null,null,null,41,396.66200279832105,14.628010299389105,9897.561463122127,41443,41661,98986,-57325,28454,34084,null,null,-315,199,5024,3095,0,0,1929,0,0,0,1929,-2000,4948,null,593,-2000,3254,{"$f":"DC4","v":28454},24150,2048,2256,21.5,null,72,50458,49386,49220,null,null,null,-8906,1243,187,-2653,178,50,-2072,276,102,9000,1500,4000,-1500,4240,0,28002,20854,7148,566,26354,20615,5739,558,24115,18694,5421,551,4159.0886868094258,4090.6498869334378,4146,1123.2558139534883,112.25822645947315,null,null,-1776,null,null,3040,-3040]
[9,"Alavieska",2740,null,0.18723926380368097,76.880301072852888,-4426.2773722627735,null,null,null,27.354709418837675,302.91970802919712,11.589074633717148,9540.5109489051101,3688,2169,17055,-14886,7397,8237,null,null,-94,4,658,652,null,null,6,null,null,null,6,-2344,657,null,190,-3970,-4167,7397,6861,169,367,21.5,null,176,2687,null,0.31894679695982625,71.468801766979567,-4254.5589877186449,null,null,null,29.986000430755976,237.81168589505026,11.019323443258056,7877.1864532936361,3613,2443,16971,-14528,7291,8376,null,null,-103,36,1072,691,null,null,381,null,null,null,381,-1962,959,null,-142,-3581,699,7291,6667,218,406,21.5,null,117,2687,null,1.531868131868132,68,-3979.531075548939,null,null,null,33,460.73688128023821,26.633855947188493,6314.1049497580943,3525,2108,17064,-14956,7792,8552,null,null,-58,6,1336,795,0,0,541,0,0,0,541,-1422,1336,null,213,0,763,7792,7099,285,408,21.5,null,74,12308,12316,12293,360,385,null,-5003,179,null,-503,99,144,-650,72,5,3900,4000,null,2500,852,500,12557,6976,5581,84,11476,6124,5352,84,11124,5479,5645,84,5332.8467153284673,4978.7867510234464,4857,330.18604651162792,122.88278619710754,null,null,-575,null,null,792,-792]
[10,"Alavus",12228,null,0.64445418676019295,50.300563703131942,-2319.103696434413,null,null,null,49.829049005951624,894.7497546614328,42.550211500964274,7675.2535165194631,33898,16997,82972,-65975,31480,37029,null,null,-320,361,2575,2872,null,null,-297,null,null,null,-297,9628,2467,null,507,-4197,-3475,31480,27504,1825,2151,19.75,null,192,12103,null,1.0135107884654164,47.220053188479604,-2219.8628439229942,null,null,null,52.352768759018758,893.91060067751789,39.861255513945103,8185.3259522432445,33994,17096,83877,-66781,33580,37689,null,null,-332,510,4666,3091,1579,null,3154,null,null,null,3154,12782,4543,null,-328,-4599,6426,33580,29054,2033,2493,20.75,null,125,12050,null,0.36828593996840442,52,-2476.1825726141078,null,null,null,50,927.13692946058086,42.450785454772586,7971.7012448132773,34642,15659,86214,-70555,34015,37398,null,null,-7,1308,1584,2982,0,0,-1398,0,0,0,-1398,11384,1475,null,-68,-6000,-3203,34015,29182,2245,2588,20.75,null,264,38953,39183,41589,null,null,null,-6302,221,139,-5004,120,6767,-5241,185,378,10900,-3500,4000,500,4783,1800,31221,26545,4676,3962,31122,25838,5284,7983,34138,26718,7420,7869,4847.8083087994764,4885.1524415434196,5039,1406.3614457831325,116.71049342598609,null,null,-4697,null,null,2706,-2706]
[16,"Asikkala",8405,null,0.41480515245393773,44.415927678075498,-2539.6787626412852,null,null,null,51.530283170006037,40.57108863771564,1.8994170430960811,7796.3117192147529,12672,6484,49957,-43473,29009,16731,null,null,10,14,2291,2190,null,null,101,94,null,null,195,1865,2249,null,171,-5880,-5976,29009,25528,1460,2021,20.75,null,159,8374,null,23.494845360824741,51.117586239308203,-2963.5777406257466,null,null,null,52.559981931583245,62.455218533556248,2.7256696556056887,8363.5060902794357,12790,6840,50890,-44050,29321,17043,null,null,-60,-42,2212,2265,5541,null,5488,94,null,null,5582,7446,7719,null,-349,-30,1124,29321,25414,1438,2469,20.75,null,207,8287,null,33.657657657657658,38,-2145.5291420296853,null,null,null,61,78.918788463859059,5.0518496571573692,5701.942801979003,13159,6847,49270,-42423,29378,16868,null,null,-78,-63,3654,2039,0,0,1615,94,0,0,1709,9156,3294,null,-129,0,2402,29378,25339,1538,2501,20.75,null,102,33643,34437,32577,null,null,null,-9435,1138,72,-14210,1281,6334,-1540,113,535,600,2400,null,9000,29,-7000,15104,1574,13530,887,24075,1485,22590,1040,17046,1480,15566,832,3073.7656157049378,4091.9512777645091,3833,1221.1566265060242,147.35810625148113,null,null,-1895,null,null,380,-380]
[18,"Askola",4991,null,1.3897849462365592,54.546411281835404,-2696.6539771588859,null,null,null,30.787004621201511,196.75415748347024,11.953643488410872,6007.8140653175715,12408,4106,27251,-23145,17645,6755,null,null,-274,296,1277,1203,8,null,82,null,null,null,82,-447,1107,null,-114,-842,31,17645,15943,771,931,20.25,null,169,5064,null,1.9491525423728813,58.256283816176975,-2829.5813586097943,null,null,null,31.40290707169688,185.42654028436021,10.692758868124669,6329.5813586097947,12656,4195,27431,-23236,18023,6984,null,null,-156,180,1795,975,null,null,820,null,null,null,820,373,1723,null,-636,-843,-861,18023,16047,935,1041,20.25,null,149,5104,null,0.45089757127771912,65,-3262.3432601880882,null,null,null,27,254.1144200626959,14.117164668694459,6570.1410658307204,12949,4397,29519,-25122,18430,6844,null,null,-137,488,290,1103,0,0,-813,0,0,0,-813,-569,157,null,517,-1300,-2207,18430,16391,987,1052,20.25,null,282,11418,11123,12710,null,null,null,-1607,300,231,-3557,860,113,-2542,21,157,null,670,null,1674,810,2198,12702,9918,2784,0,13533,9142,4391,0,16221,9650,6571,0,3604.6884391905428,3731.0426540284357,4215,809.4320987654321,158.5877936452649,null,null,-2484,null,null,699,-699]
[19,"Aura",3962,null,1.0578313253012048,71.18982405645049,-3249.8738011105502,null,null,null,15.995030250648227,304.13932357395259,19.422609847648488,5715.547703180212,7070,2332,20688,-18356,13501,5708,null,null,-108,24,769,647,null,null,122,28,null,null,150,-2271,671,null,654,-721,-277,13501,12683,283,535,21,null,201,3982,null,0.15177478580171358,72.647154320701333,-3522.0994475138123,null,null,null,12.9486969349287,127.82521346057257,7.7714799631891571,6003.5158211953794,7121,2826,21450,-18624,13628,5105,null,null,-94,14,29,620,null,null,-591,28,null,null,-563,-2834,-99,null,126,-722,-1206,13628,12545,459,624,21,null,291,3986,null,0.89258312020460362,74,-3805.0677370797794,null,null,null,12,123.93376818866031,7.8569872325591525,5757.400903161064,7090,3226,21799,-18573,13875,5377,null,null,-64,22,634,784,0,0,-150,28,0,0,-122,-2956,452,null,243,0,-1098,13875,12633,506,736,21,null,257,11236,11861,12248,515,null,null,-1118,13,157,-1634,351,176,-1867,75,242,null,-60,null,750,718,2000,13274,5123,8151,0,13303,4405,8898,0,14585,3691,10894,0,4404.3412417970721,4259.166248116524,5419,601.57142857142856,150.92108092609848,null,null,-1321,null,null,607,-607]
[46,"Enonkoski",1522,null,6.8719999999999999,15.714408454334565,632.06307490144548,null,null,null,83.733403675371491,1687.910643889619,72.559390234465681,8490.8015768725363,4278,2197,10890,-8693,4238,5204,null,null,32,73,854,331,null,44,479,null,null,-1,478,4513,809,null,7,-120,-1087,4238,3478,432,328,20.5,null,39,1503,null,9.6444444444444439,17.702207449075257,858.28343313373261,null,null,null,82.386506671142072,2107.1190951430472,98.429410762942794,7813.7059214903529,4533,2142,10958,-8816,4394,5197,null,null,31,52,858,413,null,150,295,null,null,null,295,4808,817,null,21,-80,257,4394,3539,495,360,21,null,47,1473,null,1.4486754966887416,11,1194.8404616429057,null,null,null,89,1955.193482688391,99.451277199621586,7175.831636116769,4521,2147,11278,-9131,4825,5096,null,null,21,119,871,511,48,0,408,0,0,0,408,5216,861,null,28,0,425,4825,3801,606,418,21,null,47,5024,4798,5199,null,null,null,-1903,null,7,-696,1,135,-497,0,61,800,80,null,null,600,-80,760,680,80,631,680,600,80,524,0,0,0,489,1983.5742444152431,1551.5635395874915,999,181,122.87847929395791,null,null,-498,null,null,63,-63]
[47,"Enontekiö",1891,null,0.24489795918367346,36.844958438742317,-2776.8376520359598,null,null,null,50.337129157926285,37.017451084082495,1.3848238482384825,9756.7424643046015,6639,2594,16705,-14111,5676,8332,null,null,-125,331,103,307,null,null,-204,null,null,null,-204,41,103,null,-270,-806,-534,5676,4687,282,707,20.75,null,261,1890,null,0.69130434782608696,39.554188192952921,-3064.5502645502643,null,null,null,49.060019495891936,121.16402116402116,4.2291540174053832,10457.142857142857,6973,2905,16911,-14006,5848,8474,null,null,-92,320,544,310,364,271,327,null,null,null,327,368,638,null,3,-828,-666,5848,4718,322,808,20.75,null,187,1861,null,0.443359375,42,-3372.3804406233207,null,null,null,47,171.95056421278881,5.8037267080745343,10814.078452444923,6877,2594,17332,-14738,6023,8833,null,null,-93,336,361,484,0,0,-123,0,0,0,-123,245,361,null,46,-1970,-472,6023,4863,338,822,20.75,null,239,7986,7906,8321,null,null,null,-637,null,null,-1738,117,317,-934,101,0,null,1063,1631,-72,931,-653,4695,2739,1956,1834,5426,3542,1884,1682,5812,4581,1231,1682,5769.4341618191438,5707.936507936508,6451,234.36144578313252,125.93307135042048,null,null,-833,null,null,874,-874]
[49,"Espoo",260753,null,2.5564503828437206,33.707394695711095,1498.364352471496,null,null,null,81.626402070750643,3000.3068037568119,157.08736980155155,6971.3560342546389,613558,328504,1573805,-1245301,1307153,40485,null,null,11789,50648,164774,108677,null,null,56097,-35686,null,35080,55491,366060,129993,null,24636,-62730,-12258,1307153,1129132,108968,69053,17.75,null,27,265543,null,2.6137180208648978,35.244289662553435,945.20661437130707,null,null,null,81.114304500844156,2603.8193437597679,130.14047429476656,7302.8323096447657,627982,331138,1627818,-1296680,1332758,29769,null,null,12027,39224,117098,117578,null,null,-480,-33559,null,40096,6057,370844,90753,null,21375,-42541,-135014,1332758,1137028,121003,74727,18,null,96,269800,null,2.8346794278801681,49,67.813194959229065,null,null,null,75,2710.8747220163086,123.14575233828513,8034.9444032616757,631945,405147,1718159,-1313012,1393802,30083,null,null,10858,35309,154834,126686,0,0,28148,-30876,0,40102,37374,397468,120723,null,2947,-269272,-147671,1393802,1161281,136157,96364,18,null,49,685761,713124,781379,null,null,null,-224938,45514,37173,-320189,59875,34547,-358407,42985,47028,116000,93207,117000,-57479,51703,42360,338665,174505,164160,286656,355644,237688,117956,286474,615573,446609,168964,364890,7221.6657142966715,8254.4107733963992,10000,64515.611111111109,239.12383658677209,null,null,-262144,null,null,55179,-55179]
[50,"Eura",12368,null,1.9146023468057367,37.489538687834447,-2006.8725743855111,null,null,null,56.260887537275977,44.388745148771022,2.2589790994972154,7172.2186287192753,34802,10541,76031,-65490,44015,24306,null,null,-202,76,2705,2498,null,null,207,32,null,null,239,8055,2594,null,-534,-1302,-6520,44015,39990,2097,1928,20.5,null,187,12314,null,0.44450768355150827,47.471226064443364,-2539.3048562611662,null,null,null,49.141892911527854,181.01348059119701,9.3249701998899681,7085.2687997401326,35557,11074,77348,-66274,43027,23921,null,null,-224,82,532,2822,null,null,-2290,30,null,null,-2260,5796,457,null,655,-1508,-5874,43027,38582,2261,2184,20.5,null,285,12128,null,1.6308630393996248,49,-2818.024406332454,null,null,null,48,118.56860158311346,6.0400699670878506,7165.0725593667548,35543,11873,77842,-65969,45291,24045,null,null,-260,114,3195,3302,0,0,-107,28,0,0,-79,5717,2951,null,-283,-6329,-3210,45291,40489,2540,2262,20.5,null,199,30600,30825,30966,null,null,null,-10737,1387,236,-7213,779,103,-7095,640,294,6400,-100,4487,4800,1850,-2600,16973,9465,7508,3730,24752,12374,12378,4313,26631,16295,10336,3883,3284.5245795601554,4125.9541984732823,4394,1975.0731707317073,162.85233927537163,null,null,-6376,null,null,818,-818]
[51,"Eurajoki",5931,null,20.670648464163822,19.880825539639321,2310.5715730905413,null,null,null,87.323579398507349,3643.7363007924464,161.10483640374167,8255.2689259821273,16971,4721,39487,-34766,36995,8966,null,null,33,791,12019,2153,null,null,9866,3,null,null,9869,57007,12018,null,355,-492,3718,36995,18577,4216,14202,18,null,1,5954,null,143.23255813953489,19.091255477233759,2721.0278804165268,null,null,null,88.751526083656884,4106.6509909304668,170.66231307606992,8783.0030231776946,17649,4795,41759,-36964,37951,9744,null,null,59,1497,12287,2648,137,null,9776,3,null,null,9779,66796,12223,null,397,-56,3343,37951,18189,4292,15470,18,null,2,5938,null,14.531390134529149,24,2284.6076119905692,null,null,null,88,3639.6092960592796,176.59234385493619,7522.7349275850447,18564,5310,42891,-37581,34546,8207,null,null,192,1096,6454,3314,0,0,3140,2,0,0,3142,69938,6264,null,-1563,0,-1866,34546,16365,2179,16002,18,null,3,18556,19970,20205,null,null,null,-8446,50,96,-9328,null,448,-8648,0,518,null,null,null,-356,419,846,3810,3454,356,450,3398,2983,415,1280,3826,2565,1261,2049,1172.1463496880795,1028.8881424252602,950,909.16666666666663,153.10991355113953,null,null,-7328,null,null,701,-701]
[52,"Evijärvi",2685,null,-0.19724770642201836,29.106982990152193,-1606.3314711359405,null,null,null,57.60276172125883,185.10242085661079,9.7137884872824642,6955.3072625698323,3989,2087,17957,-15870,7789,7996,null,null,-37,-4,-126,353,null,null,-479,null,null,null,-479,-1574,-137,null,15,-396,-283,7789,6628,564,597,21,null,287,2651,null,4.682634730538922,27.953905249679899,437.57072802715959,null,null,null,70.965542560444746,2331.9502074688799,115.66097698498129,7359.1097698981512,4049,2274,17996,-15722,8849,8402,null,null,-29,22,1522,364,4982,null,6140,null,null,null,6140,4782,1323,null,-44,-293,5538,8849,7351,782,716,21.5,null,46,2576,null,2.0078125,28,448.75776397515529,null,null,null,72,2312.8881987577643,120.79486752207966,6988.7422360248447,3951,1851,18133,-16282,8877,7848,null,null,37,12,492,409,0,0,83,0,0,0,83,4866,485,null,19,0,-70,8877,7048,1099,730,21.5,null,243,12640,12654,12858,null,375,null,-258,52,60,-1177,null,5392,-574,0,19,null,1100,null,1100,234,-500,3602,409,3193,228,4409,175,4234,221,3675,0,3675,214,2111.3594040968346,2514.1456054319128,2290,327.81395348837208,127.25696952188356,null,null,-540,null,null,500,-500]
{"$rows_left_out":289}