{"text_format":"1","workbook":"xlsx","n_sheets":2,"sheets":["Kuntakortti","Luvut"],"not_rendered":{"charts":0,"images":0,"macros":1,"external_links":0,"defined_names":2,"comments":0,"pivot_tables":0},"unopened":[],"bounds":{"document_bytes":16777216,"sheet_cells":100000,"rows_first":2000,"rows_last":500,"rows_between":2000,"halvings":0,"cell_chars":16384,"cell_head_chars":4096},"cells_cut":0,"cells_raw":0,"read":"whole","date_system":"1900"}

{"sheet":"Kuntakortti","index":0,"n_rows":79,"n_cols":16,"rows_kept":79,"cut":false,"hidden":false,"merged":[[1,6,1,7]]}
["Valtiovarainministeriö/Kunta- ja aluehallinto-osasto,2.6.2017"]
["KUNTAKONSERNIEN TP 2015 - 2016 (lyhennetty kaava)",null,null,null,null,null,"Valitse kunta valikosta:"]
[null,null,null,null,null,null,null," "]
[{"$f":"INDEX(Luvut!$B$3:'Luvut'!$B$300,$A$7)","v":"KOKO MAA (Manner-Suomi)"},null,null,2015,null,null,2016,null,null,2017]
[]
["Asukasluku",null,null,{"$f":"VLOOKUP($A$4,Luvut!$B$3:$AV$300,2)","v":5458325},null,null,{"$f":"VLOOKUP($A$4,Luvut!$B$3:$EH$300,48)","v":5474085}," ",{"$f":"((G6/D6)-1)*100","v":0.28873326524163634},{"$f":"VLOOKUP($A$4,Luvut!$B$3:$EH$300,90)","v":0}," ",{"$f":"((J6/G6)-1)*100","v":-100}]
[97,null,null," "]
["Tunnuslukuja",null,null," ",null,null,null,null,null,null,null,null,null,"Konsernilaina","Konsernilaina","Konsernilaina"]
[null,null,null," "," "," "," ",null,"muut.%"," ",null,"muut.%",null,2015,2016,2017]
["Lainat, euro/as",null,null,{"$f":"E67","v":5988.9237082804702}," ",null,{"$f":"H67","v":6157.9717888925725},null,{"$f":"((G10/D10)-1)*100","v":2.8226788125280455},{"$f":"K67","v":{"$error":"#DIV/0!"}},null,{"$f":"((J10/G10)-1)*100","v":{"$error":"#DIV/0!"}},null,{"$f":"D6*D10","v":32689491999.999996},{"$f":"G6*G10","v":33709260999.999996},{"$f":"F6*F10","v":0}]
[]
["Lainanhoitokate",null,null,{"$f":"VLOOKUP($A$4,Luvut!$B$3:$AV$300,4)","v":1.5}," ",null,{"$f":"VLOOKUP($A$4,Luvut!$B$3:$EH$300,50)","v":1.6},null,null,{"$f":"VLOOKUP($A$4,Luvut!$B$3:$EH$300,92)","v":0}]
["Suhteellinen velkaantuneisuus, %",null,null,{"$f":"VLOOKUP($A$4,Luvut!$B$3:$AV$300,5)","v":78.165535842233837}," ",null,{"$f":"VLOOKUP($A$4,Luvut!$B$3:$EH$300,51)","v":77.599999999999994},null,null,{"$f":"VLOOKUP($A$4,Luvut!$B$3:$EH$300,93)","v":0}]
["Rahoitusvarallisuus, euro/as",null,null,{"$f":"VLOOKUP($A$4,Luvut!$B$3:$AV$300,6)","v":-5903.2835164633843}," ",null,{"$f":"VLOOKUP($A$4,Luvut!$B$3:$EH$300,52)","v":-5949},null,null,{"$f":"VLOOKUP($A$4,Luvut!$B$3:$EH$300,94)","v":0}]
["Omavaraisuusaste, %",null,null,{"$f":"VLOOKUP($A$4,Luvut!$B$3:$AV$300,10)","v":43.118510885775947},null,null,{"$f":"VLOOKUP($A$4,Luvut!$B$3:$EH$300,56)","v":42.9},null,null,{"$f":"VLOOKUP($A$4,Luvut!$B$3:$EH$300,98)","v":0}]
{"$rows_left_out":65}
{"sheet":"Luvut","index":1,"n_rows":300,"n_cols":183,"rows_kept":300,"cut":false,"hidden":false,"merged":[]}
[null,null,2015,"hakee muualta",92,93,94,"vanha",96,97,98,99,100,101,102,103,104,null,105,106,107,108,"summana",110,111,112,113,114,115,116,null,117,118,119,120,121,122,"kaavasta",124,125,126,127,128,129,130,131,"kaavasta",133,2016,"hakee muualta",92,93,94,"vanha",96,97,98,99,100,101,102,103,104,null,105,106,107,108,"summana",110,111,112,113,114,115,116,117,null,118,119,120,121,122,"kaavasta",124,125,126,127,128,129,130,131,"kaavasta",133,2017,"hakee muualta",92,93,94,"vanha",96,97,98,99,100,101,102,103,104,105,106,107,108,"summana",110,111,112,113,114,115,116,117,118,119,120,121,122,"kaavasta",124,125,126,127,128,129,130,131,"kaavasta",133,"Erillistiedot",135,136,137,138,139,2015,144,145,2016,147,148,2017,147,148,2015,152,2016,154,2017,null,2015,160,161,162,2016,164,165,166,2017,164,165,166,null,null,null,"Yhden vero%:n","Yhden vero%:n",null,null,"Nettoinv."]
["Kunta nro","Kunta","Asukasluku ","Lainat e/asukas","Lainanhoitokate","Suhteellinen velkaantuneisuus-%","Rahoitusvarallisuus, e/as","Vuosikate","Suunnitelman mukaiset poistot","Tilikauden tulos","Omavaraisuusaste, %","Rahavarat e/as","Kassan riittävyys, pv","Kassasta maksut, €/as","Henkilöstökulut","Toimintatuotot","Toimintakulut","Osuus osakkuusyhteisojen voitosta/tappiosta","Toimintakate","Verotulot","Valtionosuudet","Alv-takaisinperintä","Käyttökate","Korkotuotot/-menot, netto","Muut rahoitustuotot/-menot, netto (sis Osinkotuotot)","Vuosikate","Suunnitelman mukaiset poistot ja arvonalet","Satu. erät, netto","Satunnaiset kulut","Tilikauden tulos","Vähemmistöosuudet","Tilinpäätössiirrot","Varausten lisäys(-) tai vähennys(+)","Rahastojen lisäys(-) tai vähennys(+)","Tilikauden yli- tai alijäämä","Kumulat yli/alij","Tulorah (toiminnan rahavirta)","Investoinnit, netto","Saamisten muutos (ent Pitkäaikaisten saamisten muutokset, netto)","Pitkäaikaisten lainojen vähennys","Toim ja inv rahavirta","Verotulot","Kunnallisvero","Osuus yhteisöveron tuotosta","Kiinteistövero","Tuloveroprosentti 2013","Yhden veroprosentin tuotto 2012","Sijoitus vuosikatteen mukaan","Asukasluku ","Lainat e/asukas","Lainanhoitokate","Suhteellinen velkaantuneisuus-%","Rahoitusvarallisuus, e/as","Vuosikate","Suunnitelman mukaiset poistot","Tilikauden tulos","Omavaraisuusaste, %","Rahavarat e/as","Kassan riittävyys, pv","Kassasta maksut, €/as","Henkilöstökulut","Toimintatuotot","Toimintakulut","Osuus osakkuusyhteisojen voitosta/tappiosta","Toimintakate","Verotulot","Valtionosuudet","Alv-takaisinperintä","Käyttökate","Korkotuotot/-menot, netto","Muut rahoitustuotot/-menot, netto (sis Osinkotuotot)","Vuosikate","Suunnitelman mukaiset poistot ja arvonalet","Satu. Erät","Satu. kulut","Tilikauden tulos","Vähemmistöosuudet","Tilinpäätössiirrot","Varausten lisäys(-) tai vähennys(+)","Rahastojen lisäys(-) tai vähennys(+)","Tilikauden yli- tai alijäämä","Kumulat yli/alij","Tulorah (toiminnan rahavirta)","Investoinnit, netto","Saamisten muutos (ent Pitkäaikaisten saamisten muutokset, netto)","Pitkäaikaisten lainojen vähennys","Toim ja inv rahavirta","Verotulot","Kunnallisvero","Osuus yhteisöveron tuotosta","Kiinteistövero","Tuloveroprosentti 2014","Yhden veroprosentin tuotto 2013","Sijoitus vuosikatteen mukaan","Asukasluku","Lainat e/asukas","Lainanhoitokate","Suhteellinen velkaantuneisuus-%","Rahoitusvarallisuus, e/as","Vuosikate","Suunnitelman mukaiset poistot","Tilikauden tulos","Omavaraisuusaste, %","Rahavarat e/as","Kassan riittävyys, pv","Kassasta maksut, €/as","Henkilöstökulut","Toimintatuotot","Toimintakulut","Toimintakate","Verotulot","Valtionosuudet","Alv-takaisinperintä","Käyttökate","Korkotuotot/-menot, netto","Muut rahoitustuotot/-menot, netto (sis Osinkotuotot)","Vuosikate","Suunnitelman mukaiset poistot ja arvonalet","Satu. tuotot","Satu. kulut","Tilikauden tulos","Poistoeron lisäys(-) tai vähennys(+)","Varausten lisäys(-) tai vähennys(+)","Rahastojen lisäys(-) tai vähennys(+)","Tilikauden yli- tai alijäämä","Kumulat yli/alij","Tulorah (toiminnan rahavirta)","Investoinnit, netto","Saamisten muutos (ent Pitkäaikaisten saamisten muutokset, netto)","Pitkäaikaisten lainojen vähennys","Toim ja inv rahavirta","Verotulot","Kunnallisvero","Osuus yhteisöveron tuotosta","Kiinteistövero","Tuloveroprosentti 2015","Yhden veroprosentin tuotto 2006","Sijoitus vuosikatteen mukaan","Palvelujen ostot 2015","Palvelujen ostot 2016","Palvelujen ostot 2017","Harkvar2015","Harkvar2016","Harkvar2017"," - Investointimenot"," + Rahoitusos. investointimenoihin"," + Investointihyödykk. luovutustulot"," - Investointimenot"," + Rahoitusosuudet investointimenoihin"," + Investointihyödykkeiden luovutustulot"," - Investointimenot"," + Rahoitusosuudet investointimenoihin"," + Investointihyödykkeiden luovutustulot","Pitkäaikaisten lainojen lisäys"," ± Lyhytaikaisten lainojen muutos","Pitkäaikaisten lainojen lisäys"," ± Lyhytaikaisten lainojen muutos","Pitkäaikaisten lainojen lisäys"," ± Lyhytaikaisten lainojen muutos","Lainakanta","josta pitkäaik","josta lyhytaik","Lainasaamiset","Lainakanta","josta pitkäaik","josta lyhytaik","Lainasaamiset","Lainakanta","josta pitkäaik","josta lyhytaik","Lainasaamiset","Konsernilainat €/as","Konsernilainat €/as","Konsernilainat €/as","tuotto","tuotto, €/as",null,null,2015]
[20,"Akaa",17043,null,0.57199329180642067,61.019939885137674,-4536.7599601009215,null,null,null,21.308179076231593,300.29924309100511,11.340881495871782,9664.9650883060494,null,57367,144558,0,-87191,59092,32589,null,null,-429,-100,3961,6334,0,null,-2373,612,-24,null,null,-2427,-8757,3282,null,1308,-7534,-6777,59092,null,null,null,21.25,null,282,16923,null,1.0921571119867801,60.475798756210722,-4432.7246942031561,null,null,null,21.108851724281031,563.37528806949126,21.969544877743896,9359.8652721148737,null,57740,143891,22,-86129,60148,34067,null,null,-317,132,7901,7116,98,null,883,-84,9,null,null,689,-7699,7815,null,1105,-7176,2261,null,null,null,null,21.25,null,243,null,null,null,null,null,null,null,null,null,null,null,null,null,null,null,null,null,null,null,null,null,null,null,null,null,null,null,null,null,null,null,null,null,null,null,null,null,null,null,null,null,null,null,null,null,null,null,null,null,null,-11427,341,1027,-6421,394,473,null,null,null,12000,2424,8646,-1099,null,null,70056,53009,17047,7333,70428,54402,16026,7390,null,null,null,null,null,null,null,{"$f":"(EC3/EF3)","v":{"$error":"#DIV/0!"}},{"$f":"(FS3/CQ3)*1000","v":{"$error":"#DIV/0!"}},null,null,-7467,null,null,4670,{"$f":"FZ3*-1","v":-4670}]
[5,"Alajärvi",10006,null,1.2723342939481268,43.968399584524285,-4158.1051369178494,null,null,null,31.692833789669475,1065.5606636018388,28.923944792526029,13446.632020787527,null,66627,124182,91,-57464,28454,36816,null,null,-500,114,7420,4849,-38,null,2533,1816,-94,null,null,2309,-783,7280,null,1223,-5719,3561,28454,null,null,null,21.5,null,103,9899,null,2.0293874855539045,41.824732200982425,-3915.5470249520154,null,null,null,34.875874753762936,926.35619759571671,23.770142533502831,14224.568138195778,null,66345,123039,77,-56617,29436,39395,null,null,-477,57,11794,4798,0,null,6996,-65,83,null,null,6937,5760,11859,null,-2632,-5559,2530,null,null,null,null,22,null,23,null,null,null,null,null,null,null,null,null,null,null,null,null,null,null,null,null,null,null,null,null,null,null,null,null,null,null,null,null,null,null,null,null,null,null,null,null,null,null,null,null,null,null,null,null,null,null,null,null,null,-4076,286,71,-11502,134,2039,null,null,null,5114,317,4181,-1500,null,null,41488,33268,8220,163,38620,32085,6535,28,null,null,null,null,null,null,null,{"$error":"#DIV/0!"},{"$error":"#DIV/0!"},null,null,-1776,null,null,3040,-3040]
[9,"Alavieska",2687,null,1.5847089487402259,49.530333851860718,-4667.6590993673244,null,null,null,30.82095709570957,177.8935615928545,5.1567995743800426,12591.365835504281,null,16292,31617,3,-15322,7790,9346,null,null,-77,9,1746,1149,0,null,597,68,0,null,null,597,-508,1733,null,175,-1073,802,7790,null,null,null,21.5,null,133,2639,null,2.0673076923076925,41.583249422496003,-3485.03220917014,null,null,null,36.636808895556634,749.52633573323226,21.422170791050977,12770.746494884426,null,16234,32053,0,-15819,7683,9849,null,null,-50,6,1669,1054,681,null,1296,-1,0,null,null,1295,329,2383,null,-1245,-781,1858,null,null,null,null,21.5,null,171,null,null,null,null,null,null,null,null,null,null,null,null,null,null,null,null,null,null,null,null,null,null,null,null,null,null,null,null,null,null,null,null,null,null,null,null,null,null,null,null,null,null,null,null,null,null,null,null,null,null,-1050,109,10,-815,9,281,null,null,null,320,424,93,-3,null,null,13050,6709,6341,84,10838,5187,5651,110,null,null,null,null,null,null,null,{"$error":"#DIV/0!"},{"$error":"#DIV/0!"},null,null,-575,null,null,792,-792]
[10,"Alavus",12050,null,0.79837212623161502,64.574406673550527,-4738.174273858921,null,null,null,35.324039638169737,1280.8298755186722,40.368687701094238,11580.829875518672,null,51581,118452,30,-66841,34014,37398,null,null,-611,920,4880,6038,0,null,-1158,366,-26,null,null,-1213,9493,4742,null,721,-6292,-8325,34014,null,null,null,20.75,null,247,11907,null,0.77409484956654773,60.311737578640255,-5001.1757789535568,null,null,null,35.397847832676568,1332.9134122784915,37.171718792109957,13088.267405727724,null,64883,130531,541,-65107,34376,38870,null,null,-449,949,8639,6022,0,null,2617,-34,-12,null,null,2515,12545,7964,null,489,-11297,-2302,null,null,null,null,21.25,null,133,null,null,null,null,null,null,null,null,null,null,null,null,null,null,null,null,null,null,null,null,null,null,null,null,null,null,null,null,null,null,null,null,null,null,null,null,null,null,null,null,null,null,null,null,null,null,null,null,null,null,-14134,194,873,-12793,546,1981,null,null,null,11219,2056,19669,554,null,null,60717,50125,10592,1764,69825,59081,10744,2204,null,null,null,null,null,null,null,{"$error":"#DIV/0!"},{"$error":"#DIV/0!"},null,null,-4697,null,null,2706,-2706]
[16,"Asikkala",8287,null,5.6312127236580514,53.271645736946461,-3954.1450464583081,null,null,null,38.247147222509263,494.02678894654281,19.413430683486418,9288.403523591167,null,30917,71353,-14,-40450,29378,16868,null,null,-306,-139,5351,3865,-30,null,1456,6,-22,null,null,1434,4148,5264,null,-440,-692,1607,29378,null,null,null,20.75,null,136,8323,null,2.090716180371353,46.726549919484704,-3451.3997356722339,null,null,null,43.606870229007633,377.38796107172897,14.377178901958816,9580.9203412231163,null,31656,71447,4,-39787,29926,17906,null,null,-176,-171,7698,4014,-6,null,3678,0,-1,null,null,3596,7509,7667,null,-1007,-3586,4275,null,null,null,null,20.75,null,70,null,null,null,null,null,null,null,null,null,null,null,null,null,null,null,null,null,null,null,null,null,null,null,null,null,null,null,null,null,null,null,null,null,null,null,null,null,null,null,null,null,null,null,null,null,null,null,null,null,null,-4426,190,579,-4015,231,392,null,null,null,1524,-2530,2274,-2000,null,null,31761,10901,20860,145,28449,9771,18678,229,null,null,null,null,null,null,null,{"$error":"#DIV/0!"},{"$error":"#DIV/0!"},null,null,-1895,null,null,380,-380]
[18,"Askola",5104,null,1.0261437908496731,65.841571705280103,-4365.9874608150467,null,null,null,19.013642778736084,398.3150470219436,17.166238693409213,8469.2398119122263,null,14479,38746,-1,-24268,18430,6844,null,null,-199,247,1054,1780,0,null,-726,10,89,null,null,-637,-2084,910,null,-663,-1022,-2100,18430,null,null,null,20.25,null,287,5046,null,1.4014900662251655,64.733287320055211,-4507.5307173999208,null,null,null,18.513468316653373,340.86405073325403,14.628917627869042,8504.7562425683718,null,14258,39091,0,-24833,19174,7136,null,null,-192,216,1501,1892,0,null,-391,0,93,null,null,-298,-2045,1323,null,-419,-1016,-961,null,null,null,null,20.25,null,275,null,null,null,null,null,null,null,null,null,null,null,null,null,null,null,null,null,null,null,null,null,null,null,null,null,null,null,null,null,null,null,null,null,null,null,null,null,null,null,null,null,null,null,null,null,null,null,null,null,null,-3207,24,173,-2567,2,281,null,null,null,1463,2176,2695,-1485,null,null,21513,14465,7048,0,21697,15999,5698,0,null,null,null,null,null,null,null,{"$error":"#DIV/0!"},{"$error":"#DIV/0!"},null,null,-2484,null,null,699,-699]
[19,"Aura",3986,null,1.1092985318107667,68.18942383583267,-4732.3130958354232,null,null,null,12.164309550293977,304.81685900652286,13.162620206577229,8452.5840441545406,null,12423,30335,1,-17911,13875,5377,null,null,-124,16,1233,1289,0,null,-56,-7,0,null,null,-91,-1894,1096,null,265,-1099,-692,13875,null,null,null,21,null,273,3984,null,2.2751054852320673,59.635085167000064,-4296.4357429718875,null,null,null,17.962466487935657,299.69879518072293,13.426890134943619,8147.0883534136537,null,12522,30312,0,-17790,14440,6032,null,null,-66,12,2628,1259,0,null,1369,-49,0,null,null,1320,-543,2607,null,156,-1117,1700,null,null,null,null,21.75,null,159,null,null,null,null,null,null,null,null,null,null,null,null,null,null,null,null,null,null,null,null,null,null,null,null,null,null,null,null,null,null,null,null,null,null,null,null,null,null,null,null,null,null,null,null,null,null,null,null,null,null,-2122,80,254,-958,3,48,null,null,null,55,1967,49,-520,null,null,21599,6586,15013,0,16296,5511,10785,0,null,null,null,null,null,null,null,{"$error":"#DIV/0!"},{"$error":"#DIV/0!"},null,null,-1321,null,null,607,-607]
[46,"Enonkoski",1473,null,1.4068181818181817,20.680842363524842,152.74949083503057,null,null,null,72.390792571279107,2188.0515953835711,58.506738946635501,13650.373387644264,null,9643,18560,0,-8917,4825,5096,null,null,-23,223,1204,802,-65,null,337,0,0,null,null,337,5610,1231,null,4,-846,696,4825,null,null,null,21,null,82,1453,null,4.4672897196261685,17.256129368805425,807.29525120440474,null,null,null,77.051005041576644,2294.5629731589815,63.816141381299495,13123.88162422574,null,9399,17959,0,-8560,4544,5227,null,null,-13,212,1410,780,-65,null,565,0,-79,null,null,495,6061,1452,null,-54,-297,806,null,null,null,null,21,null,58,null,null,null,null,null,null,null,null,null,null,null,null,null,null,null,null,null,null,null,null,null,null,null,null,null,null,null,null,null,null,null,null,null,null,null,null,null,null,null,null,null,null,null,null,null,null,null,null,null,null,-661,6,120,-787,73,68,null,null,null,84,-98,44,-82,null,null,1471,1269,202,0,1164,1022,142,-53,null,null,null,null,null,null,null,{"$error":"#DIV/0!"},{"$error":"#DIV/0!"},null,null,-498,null,null,63,-63]
[47,"Enontekiö",1861,null,1.0804093567251463,94.72455902306649,-6750.1343363782917,null,null,null,35.340667139815473,1836.1096184846856,58.692,11418.592154755508,null,3569,17395,6,-13820,6023,8833,null,null,-204,429,1261,1198,5,null,68,633,-74,null,null,-10,-107,1237,null,926,-1151,-879,6023,null,null,null,20.75,null,122,1872,null,1.1660405709992487,99.922317167905888,-7270.2991452991455,null,null,null,31.974544811737669,1537.9273504273506,48.254350920696155,11633.01282051282,null,2936,16836,-4,-13904,6151,8935,null,null,-82,266,1366,1108,0,null,258,-1,0,null,null,259,576,1306,null,540,-1145,-924,null,null,null,null,21.25,null,131,null,null,null,null,null,null,null,null,null,null,null,null,null,null,null,null,null,null,null,null,null,null,null,null,null,null,null,null,null,null,null,null,null,null,null,null,null,null,null,null,null,null,null,null,null,null,null,null,null,null,-2234,117,1,-3331,1021,80,null,null,null,2723,-701,307,456,null,null,12005,10495,1510,81,11675,9704,1971,81,null,null,null,null,null,null,null,{"$error":"#DIV/0!"},{"$error":"#DIV/0!"},null,null,-833,null,null,874,-874]
[49,"Espoo",269800,null,1.7462666552888542,130.50532048272805,-7779.9518161601191,null,null,null,44.210517709673859,3313.4284655300221,103.60595624752533,11673.087472201631,null,954496,2193314,692,-1238126,1393802,84376,null,null,-27346,33521,246227,220614,0,null,25613,9431,39148,null,null,64719,558885,210727,null,16740,-123793,-481200,1393802,null,null,null,18,null,53,274583,null,1.9425422165541271,140.2772277383321,-8531.3329667168036,null,null,null,41.82287592228009,3764.1733100738206,120.0713733051426,11442.554710233337,null,982749,2234818,-2334,-1254403,1446483,116040,null,null,-30747,20127,297500,237379,13541,null,73662,29,60,null,null,72112,629653,259201,null,-12525,-131950,-372917,null,null,null,null,18,null,37,null,null,null,null,null,null,null,null,null,null,null,null,null,null,null,null,null,null,null,null,null,null,null,null,null,null,null,null,null,null,null,null,null,null,null,null,null,null,null,null,null,null,null,null,null,null,null,null,null,null,-776344,43335,41082,-726495,30414,63963,null,null,null,639085,-9183,626942,-6325,null,null,2698010,2562825,135185,211961,3186678,3056512,130166,210467,null,null,null,null,null,null,null,{"$error":"#DIV/0!"},{"$error":"#DIV/0!"},null,null,-262144,null,null,55179,-55179]
[50,"Eura",12128,null,1.4238717840573598,66.612451599190464,-4857.3548812664912,null,null,null,33.728127982547832,487.13720316622693,18.432358044635912,9646.3555408970969,null,36066,102621,-44,-66599,45291,26854,null,null,-784,1203,5965,5645,0,null,320,553,-102,null,null,93,3737,6377,null,-451,-3955,-2619,45291,null,null,null,20.5,null,212,12004,null,1.4813710879284649,67.054980741635831,-4887.9540153282242,null,null,null,33.723507537872543,497.41752749083639,19.564395809581946,9279.9900033322228,null,35238,100185,0,-64947,43653,27037,null,null,-703,1208,6248,5435,0,null,813,-43,0,null,null,642,4004,6368,null,880,-3987,-59,null,null,null,null,20.5,null,222,null,null,null,null,null,null,null,null,null,null,null,null,null,null,null,null,null,null,null,null,null,null,null,null,null,null,null,null,null,null,null,null,null,null,null,null,null,null,null,null,null,null,null,null,null,null,null,null,null,null,-9582,640,-54,-6501,87,-13,null,null,null,8717,-2539,271,4200,null,null,53290,41396,11894,70,54035,38127,15908,50,null,null,null,null,null,null,null,{"$error":"#DIV/0!"},{"$error":"#DIV/0!"},null,null,-6376,null,null,818,-818]
[51,"Eurajoki",5938,null,61.895104895104893,24.453319267575917,2035.5338497810708,null,null,null,83.039851714550508,3815.2576625126303,115.27895888806792,12079.99326372516,null,23606,58773,-2,-35169,34542,8207,null,null,124,1082,8786,3763,-2,null,5021,17,0,null,null,5019,68463,7549,null,-1628,-78,-3181,34542,null,null,null,18,null,2,6070,null,9.1562189054726364,22.306942104796523,2182.537067545305,null,null,null,84.828522920203739,4058.1548599670514,130.27290377733021,11370.181219110378,null,21029,59307,-6,-38284,38036,8609,null,null,71,731,9163,4275,3,null,4891,2,0,null,null,4886,73485,9091,null,1833,-966,1073,null,null,null,null,18,null,7,null,null,null,null,null,null,null,null,null,null,null,null,null,null,null,null,null,null,null,null,null,null,null,null,null,null,null,null,null,null,null,null,null,null,null,null,null,null,null,null,null,null,null,null,null,null,null,null,null,null,-10962,31,201,-8307,16,273,null,null,null,545,666,26,-904,null,null,5640,3632,2008,146,3694,2948,746,130,null,null,null,null,null,null,null,{"$error":"#DIV/0!"},{"$error":"#DIV/0!"},null,null,-7328,null,null,701,-701]
[52,"Evijärvi",2576,null,2.7793296089385473,34.509915938953725,-232.91925465838509,null,null,null,59.005049560501213,2682.4534161490683,100.45204715628485,9746.8944099378878,null,7223,23615,7,-16385,8877,8406,null,null,13,37,948,798,0,null,150,143,-32,null,null,112,3263,935,null,98,-311,10,8877,null,null,null,21.5,null,258,2535,null,2.3192019950124689,35.036466273847296,-347.14003944773174,null,null,null,56.236619193893695,2625.2465483234714,96.334523101328585,9946.7455621301779,null,7088,23575,4,-16483,8615,8566,null,null,171,35,904,834,0,null,70,-7,-30,null,null,25,3286,924,null,47,-375,-273,null,null,null,null,21.5,null,264,null,null,null,null,null,null,null,null,null,null,null,null,null,null,null,null,null,null,null,null,null,null,null,null,null,null,null,null,null,null,null,null,null,null,null,null,null,null,null,null,null,null,null,null,null,null,null,null,null,null,-1124,176,23,-1216,9,10,null,null,null,39,-494,173,500,null,null,5899,1745,4154,58,6210,1705,4505,57,null,null,null,null,null,null,null,{"$error":"#DIV/0!"},{"$error":"#DIV/0!"},null,null,-540,null,null,500,-500]
{"$rows_left_out":285}