{"text_format":"1","workbook":"xlsx","n_sheets":2,"sheets":["Kuntakortti","Luvut"],"not_rendered":{"charts":0,"images":0,"macros":1,"external_links":0,"defined_names":2,"comments":0,"pivot_tables":0},"unopened":[],"bounds":{"document_bytes":16777216,"sheet_cells":100000,"rows_first":2000,"rows_last":500,"rows_between":2000,"halvings":0,"cell_chars":16384,"cell_head_chars":4096},"cells_cut":0,"cells_raw":0,"read":"whole","date_system":"1900"}

{"sheet":"Kuntakortti","index":0,"n_rows":79,"n_cols":16,"rows_kept":79,"cut":false,"hidden":false,"merged":[[1,6,1,7]]}
["Valtiovarainministeriö/Kunta- ja aluehallinto-osasto,5.6.2017"]
["KUNTIEN LOPULLISET TP:T 2014-2015 JA TPENNAKKO 2016",null,null,null,null,null,"Valitse kunta valikosta:"]
[null,null,null,null,null,null,null," "]
[{"$f":"INDEX(Luvut!$B$3:'Luvut'!$B$300,$A$7)","v":"KOKO MAA (Manner-Suomi)"},null,null,2014,null,null,2015,null,null,2016]
[]
["Asukasluku",null,null,{"$f":"VLOOKUP($A$4,Luvut!$B$3:$AT$300,2)","v":5442837},null,null,{"$f":"VLOOKUP($A$4,Luvut!$B$3:$ED$300,46)","v":5458325}," ",{"$f":"((G6/D6)-1)*100","v":0.28455748353295451},{"$f":"VLOOKUP($A$4,Luvut!$B$3:$ED$300,90)","v":5474083}," ",{"$f":"((J6/G6)-1)*100","v":0.28869662396431295}]
[97,null,null," "]
["Tunnuslukuja",null,null," "]
[null,null,null," "," "," "," ",null,"muut.%"," ",null,"muut.%",null,"Konsernivelka","Konsernivelka","Konsernivelka"]
["Lainat, euro/as",null,null,{"$f":"E67","v":2696.5986672024169}," ",null,{"$f":"H67","v":2840.5019854992147},null,{"$f":"((G10/D10)-1)*100","v":5.3364751695175405},{"$f":"K67","v":2939.1072440808807},null,{"$f":"((J10/G10)-1)*100","v":3.4714025578945762},null,"2014, milj. €","2015, milj. €","2016, milj. €"]
["Konsernilainat, euro/as",null,null,{"$f":"VLOOKUP($A$4,Luvut!$B$3:$FM$300,167)","v":5774},null,null,{"$f":"VLOOKUP($A$4,Luvut!$B$3:$FM$300,168)","v":5987},null,{"$f":"((G11/D11)-1)*100","v":3.6889504676134388},{"$f":"VLOOKUP($A$4,Luvut!$B$3:$FN$300,169)","v":6157.9717888925734},null,{"$f":"((J11/G11)-1)*100","v":2.8557172021475452},null,{"$f":"D11*D6","v":31426940838},{"$f":"G11*G6","v":32678991775},{"$f":"J11*J6","v":33709248684.056423}]
["Lainanhoitokate",null,null,{"$f":"VLOOKUP($A$4,Luvut!$B$3:$AT$300,4)","v":1.2}," ",null,{"$f":"VLOOKUP($A$4,Luvut!$B$3:$ED$300,48)","v":1.06},null,null,{"$f":"VLOOKUP($A$4,Luvut!$B$3:$ED$300,92)","v":1.3845192262264607}]
["Suhteellinen velkaantuneisuus, %",null,null,{"$f":"VLOOKUP($A$4,Luvut!$B$3:$AT$300,5)","v":52}," ",null,{"$f":"VLOOKUP($A$4,Luvut!$B$3:$ED$300,49)","v":54.9},null,null,{"$f":"VLOOKUP($A$4,Luvut!$B$3:$ED$300,93)","v":55.694527011770546}]
["Rahoitusvarallisuus, euro/as",null,null,{"$f":"VLOOKUP($A$4,Luvut!$B$3:$AT$300,6)","v":-2415}," ",null,{"$f":"VLOOKUP($A$4,Luvut!$B$3:$ED$300,50)","v":-2611.6389185327002},null,null,{"$f":"VLOOKUP($A$4,Luvut!$B$3:$ED$300,94)","v":-2634.5813536258038}]
["Omavaraisuusaste, %",null,null,{"$f":"VLOOKUP($A$4,Luvut!$B$3:$AT$300,10)","v":61},null,null,{"$f":"VLOOKUP($A$4,Luvut!$B$3:$ED$300,54)","v":60.17},null,null,{"$f":"VLOOKUP($A$4,Luvut!$B$3:$ED$300,98)","v":59.790257761132146}]
{"$rows_left_out":65}
{"sheet":"Luvut","index":1,"n_rows":300,"n_cols":179,"rows_kept":300,"cut":false,"hidden":false,"merged":[]}
[null,null,2014,"hakee muualta",92,93,94,"vanha",96,97,98,99,100,101,102,103,104,105,106,107,108,"summana",110,111,112,113,114,115,116,117,118,119,120,121,122,"kaavasta",124,125,126,127,128,129,130,131,"kaavasta",133,2015,"hakee muualta",92,93,94,"vanha",96,97,98,99,100,101,102,103,104,105,106,107,108,"summana",110,111,112,113,114,115,116,117,118,119,120,121,122,"kaavasta",124,125,126,127,128,129,130,131,"kaavasta",133,2016,"hakee muualta",92,93,94,"vanha",96,97,98,99,100,101,102,103,104,105,106,107,108,"summana",110,111,112,113,114,115,116,117,118,119,120,121,122,"kaavasta",124,125,126,127,128,129,130,131,"kaavasta",133,"Erillistiedot",135,136,137,138,139,2014,144,145,2015,147,148,2016,147,148,2014,152,2015,154,2016,null,2014,160,161,162,2015,164,165,166,2016,164,165,166,2014,2015,2016,"Yhden vero%:n","Yhden vero%:n",null,null,"Nettoinv."]
["Kunta nro","Kunta","Asukasluku ","Lainat e/asukas","Lainanhoitokate","Suhteellinen velkaantuneisuus-%","Rahoitusvarallisuus, e/as","Vuosikate","Suunnitelman mukaiset poistot","Tilikauden tulos","Omavaraisuusaste, %","Rahavarat e/as","Kassan riittävyys, pv","Kassasta maksut, €/as","Henkilöstökulut","Toimintatuotot","Toimintakulut","Toimintakate","Verotulot","Valtionosuudet","Alv-takaisinperintä","Käyttökate","Korkotuotot/-menot, netto","Muut rahoitustuotot/-menot, netto (sis Osinkotuotot)","Vuosikate","Suunnitelman mukaiset poistot ja arvonalet","Satunnaiset tuotot","Satunnaiset kulut","Tilikauden tulos","Poistoeron lisäys(-) tai vähennys(+)","Varausten lisäys(-) tai vähennys(+)","Rahastojen lisäys(-) tai vähennys(+)","Tilikauden yli- tai alijäämä","Kumulat yli/alij","Tulorah (toiminnan rahavirta)","Investoinnit, netto","Saamisten muutos (ent Pitkäaikaisten saamisten muutokset, netto)","Pitkäaikaisten lainojen vähennys","Toim ja inv rahavirta","Verotulot","Kunnallisvero","Osuus yhteisöveron tuotosta","Kiinteistövero","Tuloveroprosentti 2013","Yhden veroprosentin tuotto 2012","Sijoitus vuosikatteen mukaan","Asukasluku ","Lainat e/asukas","Lainanhoitokate","Suhteellinen velkaantuneisuus-%","Rahoitusvarallisuus, e/as","Vuosikate","Suunnitelman mukaiset poistot","Tilikauden tulos","Omavaraisuusaste, %","Rahavarat e/as","Kassan riittävyys, pv","Kassasta maksut, €/as","Henkilöstökulut","Toimintatuotot","Toimintakulut","Toimintakate","Verotulot","Valtionosuudet","Alv-takaisinperintä","Käyttökate","Korkotuotot/-menot, netto","Muut rahoitustuotot/-menot, netto (sis Osinkotuotot)","Vuosikate","Suunnitelman mukaiset poistot ja arvonalet","Satu. tuotot","Satu. kulut","Tilikauden tulos","Poistoeron lisäys(-) tai vähennys(+)","Varausten lisäys(-) tai vähennys(+)","Rahastojen lisäys(-) tai vähennys(+)","Tilikauden yli- tai alijäämä","Kumulat yli/alij","Tulorah (toiminnan rahavirta)","Investoinnit, netto","Saamisten muutos (ent Pitkäaikaisten saamisten muutokset, netto)","Pitkäaikaisten lainojen vähennys","Toim ja inv rahavirta","Verotulot","Kunnallisvero","Osuus yhteisöveron tuotosta","Kiinteistövero","Tuloveroprosentti 2014","Yhden veroprosentin tuotto 2013","Sijoitus vuosikatteen mukaan","Asukasluku","Lainat e/asukas","Lainanhoitokate","Suhteellinen velkaantuneisuus-%","Rahoitusvarallisuus, e/as","Vuosikate","Suunnitelman mukaiset poistot","Tilikauden tulos","Omavaraisuusaste, %","Rahavarat e/as","Kassan riittävyys, pv","Kassasta maksut, €/as","Henkilöstökulut","Toimintatuotot","Toimintakulut","Toimintakate","Verotulot","Valtionosuudet","Alv-takaisinperintä","Käyttökate","Korkotuotot/-menot, netto","Muut rahoitustuotot/-menot, netto (sis Osinkotuotot)","Vuosikate","Suunnitelman mukaiset poistot ja arvonalet","Satu. tuotot","Satu. kulut","Tilikauden tulos","Poistoeron lisäys(-) tai vähennys(+)","Varausten lisäys(-) tai vähennys(+)","Rahastojen lisäys(-) tai vähennys(+)","Tilikauden yli- tai alijäämä","Kumulat yli/alij","Toiminnan rahavirta","Investoinnit, netto","Saamisten muutos (ent Pitkäaikaisten saamisten muutokset, netto)","Pitkäaikaisten lainojen vähennys","Toim ja inv rahavirta","Verotulot","Kunnallisvero","Osuus yhteisöveron tuotosta","Kiinteistövero","Tuloveroprosentti 2015","Yhden veroprosentin tuotto 2006","Sijoitus vuosikatteen mukaan","Palvelujen ostot 2014","Palvelujen ostot 2015","Palvelujen ostot 2016","Harkvar2014","Harkvar2015","Harkvar2016"," - Investointimenot"," + Rahoitusos. investointimenoihin"," + Investointihyödykk. luovutustulot"," - Investointimenot"," + Rahoitusosuudet investointimenoihin"," + Investointihyödykkeiden luovutustulot"," - Investointimenot"," + Rahoitusosuudet investointimenoihin"," + Investointihyödykkeiden luovutustulot","Pitkäaikaisten lainojen lisäys"," ± Lyhytaikaisten lainojen muutos","Pitkäaikaisten lainojen lisäys"," ± Lyhytaikaisten lainojen muutos","Pitkäaikaisten lainojen lisäys"," ± Lyhytaikaisten lainojen muutos","Lainakanta","josta pitkäaik","josta lyhytaik","Lainasaamiset","Lainakanta","josta pitkäaik","josta lyhytaik","Lainasaamiset","Lainakanta","josta pitkäaik","josta lyhytaik","Lainasaamiset","Konsernilainat €/as","Konsernilainat €/as","Konsernilainat €/as","tuotto","tuotto, €/as",null,null,2015]
[20,"Akaa",17052,null,-8.7525844245348039E-2,59.775833887162541,-3520.9359605911332,null,null,null,29.320831221490117,47.091250293220732,2.1911187530370424,7844.5343654703265,48569,22820,112573,-89753,57963,30594,null,null,-292,184,-1304,3763,null,null,-5067,32,null,null,-5035,-5243,-1711,null,2115,-6586,-14048,57963,53091,1707,3165,21,null,300,17043,null,0.24972421400992831,66,-3907.1759666725343,null,null,null,25,117.46758199847444,5.5798379645537919,7684.0345009681396,47398,22841,110377,-87536,59092,29881,null,null,-218,40,1229,4203,0,0,-2974,31,0,0,-2943,-8186,758,null,790,-12000,-6593,59092,54123,1775,3194,21.25,null,277,16923,null,0.73550271172298709,62.860961626393724,-3766.7080304910478,null,null,null,25.642957397622194,245.81929917863263,12.783942613703335,7.0184955386160848,46980,22331,109001,-86670,60148,31248,null,null,-163,204,4767,4712,0,0,55,29,0,0,84,-8105,4602,null,1344,-6669,2675,60148,55165,1606,3377,21.25,null,219,48004,47031,46809,null,null,null,-13964,1161,466,-8431,341,739,-2583,394,262,10311,7580,6670,2418,5427,-908,52203,38354,13849,7333,59953,43679,16274,7333,57802,42557,15245,7333,3704.8440065681448,4111,4161.6734621521009,{"$f":"(DY3/EB3)","v":2596},{"$f":"(FO3/CM3)*1000","v":153.4006972758967},null,null,-7467,null,null,4670,{"$f":"FV3*-1","v":-4670}]
[5,"Alajärvi",10171,null,0.80636604774535814,36.457513579915158,-3052.6005309212464,null,null,null,36.733583860759495,294.26801691082488,10.107650743423914,10626.388752335071,42751,43017,100641,-57624,28360,32821,null,null,-363,78,3272,3076,null,null,196,null,null,null,196,-3929,3239,null,-7,-4148,814,28360,24370,1764,2226,21,null,172,10006,null,1.1717791411042944,33,-2771.6370177893264,null,null,null,41,396.66200279832105,14.628010299389105,9897.561463122127,41443,41661,98986,-57325,28454,34084,null,null,-315,199,5024,3095,0,0,1929,0,0,0,1929,-2000,4948,null,593,-2000,3254,28454,24150,2048,2256,21.5,null,72,9899,null,2.4633738964447627,28.221488612089772,-2140.9233255884433,null,null,null,50.275229357798167,432.77098696838061,14.539993676889027,10.86392564905546,40424,41721,97917,-56196,29436,36984,null,null,-254,84,10054,3035,0,0,7019,0,0,0,7019,5020,9909,null,-1787,-3921,6412,29436,25084,2039,2313,22,null,8,49386,49220,48991,null,null,null,-2653,178,50,-2072,276,102,-5261,134,1630,4000,-1500,4240,null,0,-1500,26354,20615,5739,558,24115,18694,5421,551,18695,15158,3537,465,4090.6498869334378,4146,3901.4041822406302,1140.1818181818182,115.18151512090294,null,null,-1776,null,null,3040,-3040]
[9,"Alavieska",2687,null,0.31894679695982625,71.468801766979567,-4254.5589877186449,null,null,null,29.986000430755976,237.81168589505026,11.019323443258056,7877.1864532936361,3613,2443,16971,-14528,7291,8376,null,null,-103,36,1072,691,null,null,381,null,null,null,381,-1962,959,null,-142,-3581,699,7291,6667,218,406,21.5,null,117,2687,null,1.531868131868132,68,-3979.531075548939,null,null,null,33,460.73688128023821,26.633855947188493,6314.1049497580943,3525,2108,17064,-14956,7792,8552,null,null,-58,6,1336,795,0,0,541,0,0,0,541,-1422,1336,null,213,0,763,7792,7099,285,408,21.5,null,74,2639,null,1.8188874514877102,62.400555288589885,-3384.2364532019706,null,null,null,38.436550351042648,328.15460401667298,16.914967624551828,7.0810913224706331,4143,2175,17327,-15152,7685,8869,null,null,-49,4,1357,811,681,0,1227,0,0,0,1227,-195,2041,null,-1232,-724,1736,7685,6892,271,522,21.5,null,85,12316,12293,11578,385,null,null,-503,99,144,-650,72,5,-576,6,265,null,2500,852,500,0,0,11476,6124,5352,84,11124,5479,5645,84,10399,4800,5599,84,4978.7867510234464,4857,4106.8586585827961,320.55813953488371,121.46954889537086,null,null,-575,null,null,792,-792]
[10,"Alavus",12103,null,1.0135107884654164,47.220053188479604,-2219.8628439229942,null,null,null,52.352768759018758,893.91060067751789,39.861255513945103,8185.3259522432445,33994,17096,83877,-66781,33580,37689,null,null,-332,510,4666,3091,1579,null,3154,null,null,null,3154,12782,4543,null,-328,-4599,6426,33580,29054,2033,2493,20.75,null,125,12050,null,0.36828593996840442,52,-2476.1825726141078,null,null,null,50,927.13692946058086,42.450785454772586,7971.7012448132773,34642,15659,86214,-70555,34015,37398,null,null,-7,1308,1584,2982,0,0,-1398,0,0,0,-1398,11384,1475,null,-68,-6000,-3203,34015,29182,2245,2588,20.75,null,264,11907,null,0.45826545280306658,53.733373994229282,-2456.9580918787265,null,null,null,50.130236362853573,1066.0955740320819,47.039157757946782,8.2723607961703198,23869,12121,81749,-69628,34482,38870,null,null,5,938,4667,3133,0,0,1534,0,0,0,1534,12918,4405,null,390,-10320,900,34482,29668,2203,2611,21.25,null,147,39183,41589,51031,null,null,null,-5004,120,6767,-5241,185,378,-5693,285,1903,4000,500,4783,1800,14200,700,31122,25838,5284,7983,34138,26718,7420,7869,38719,31130,7589,8137,4885.1524415434196,5039,5864.1975308641977,1396.1411764705883,117.25381510628944,null,null,-4697,null,null,2706,-2706]
[16,"Asikkala",8374,null,23.494845360824741,51.117586239308203,-2963.5777406257466,null,null,null,52.559981931583245,62.455218533556248,2.7256696556056887,8363.5060902794357,12790,6840,50890,-44050,29321,17043,null,null,-60,-42,2212,2265,5541,null,5488,94,null,null,5582,7446,7719,null,-349,-30,1124,29321,25414,1438,2469,20.75,null,207,8287,null,33.657657657657658,38,-2145.5291420296853,null,null,null,61,78.918788463859059,5.0518496571573692,5701.942801979003,13159,6847,49270,-42423,29378,16868,null,null,-78,-63,3654,2039,0,0,1615,94,0,0,1709,9156,3294,null,-129,0,2402,29378,25339,1538,2501,20.75,null,102,8323,null,67.654320987654316,33.603082851637765,-1769.1938003123873,null,null,null,65.710919088766687,38.687973086627423,2.2587154552792406,6.2518322720173014,13727,6668,48906,-42238,29925,17906,null,null,-50,-115,5428,2164,0,0,3264,94,-2000,0,1358,10514,5331,null,-1284,-29,3076,29925,25836,1430,2659,20.75,null,42,34437,32577,31541,null,null,null,-14210,1281,6334,-1540,113,535,-2644,178,211,null,9000,29,-7000,0,-2000,24075,1485,22590,1040,17046,1480,15566,832,15016,1474,13542,817,4091.9512777645091,3833,3418.1184668989549,1245.1084337349398,149.59851420580796,null,null,-1895,null,null,380,-380]
[18,"Askola",5064,null,1.9491525423728813,58.256283816176975,-2829.5813586097943,null,null,null,31.40290707169688,185.42654028436021,10.692758868124669,6329.5813586097947,12656,4195,27431,-23236,18023,6984,null,null,-156,180,1795,975,null,null,820,null,null,null,820,373,1723,null,-636,-843,-861,18023,16047,935,1041,20.25,null,149,5104,null,0.45089757127771912,65,-3262.3432601880882,null,null,null,27,254.1144200626959,14.117164668694459,6570.1410658307204,12949,4397,29519,-25122,18430,6844,null,null,-137,488,290,1103,0,0,-813,0,0,0,-813,-569,157,null,517,-1300,-2207,18430,16391,987,1052,20.25,null,282,5046,null,1.1625258799171843,63.322058153906198,-3389.0210067380103,null,null,null,25.534617827651918,235.83036068172811,13.412073490813649,6.4179548156956008,13037,4436,29873,-25437,19174,7136,null,null,-140,250,983,1213,0,0,-230,0,0,0,-230,-799,830,null,47,-826,-460,19174,17262,868,1044,20.25,null,245,11123,12710,12983,null,null,null,-3557,860,113,-2542,21,157,-1534,0,244,null,1674,810,2198,2692,-1514,13533,9142,4391,0,16221,9650,6571,0,16573,11381,5192,0,3731.0426540284357,4215,4299.8414585810551,852.44444444444446,168.934689743251,null,null,-2484,null,null,699,-699]
[19,"Aura",3982,null,0.15177478580171358,72.647154320701333,-3522.0994475138123,null,null,null,12.9486969349287,127.82521346057257,7.7714799631891571,6003.5158211953794,7121,2826,21450,-18624,13628,5105,null,null,-94,14,29,620,null,null,-591,28,null,null,-563,-2834,-99,null,126,-722,-1206,13628,12545,459,624,21,null,291,3986,null,0.89258312020460362,74,-3805.0677370797794,null,null,null,12,123.93376818866031,7.8569872325591525,5757.400903161064,7090,3226,21799,-18573,13875,5377,null,null,-64,22,634,784,0,0,-150,28,0,0,-122,-2956,452,null,243,0,-1098,13875,12633,506,736,21,null,257,3984,null,2.3382352941176472,64.000849437247822,-3546.1847389558234,null,null,null,17.363100708146387,92.620481927710841,5.7874269508422147,5.8413654618473894,6754,3073,21803,-18730,14440,6032,null,null,-34,7,1715,724,0,0,991,28,0,0,1019,-1937,1708,null,313,-714,1030,14440,13272,758,410,21.75,null,124,11861,12248,12576,null,null,null,-1634,351,176,-1867,75,242,-719,0,41,null,750,718,2000,0,-590,13303,4405,8898,0,14585,3691,10894,0,13280,2976,10304,0,4259.166248116524,5419,4090.3614457831327,610.20689655172418,153.1643816645894,null,null,-1321,null,null,607,-607]
[46,"Enonkoski",1503,null,9.6444444444444439,17.702207449075257,858.28343313373261,null,null,null,82.386506671142072,2107.1190951430472,98.429410762942794,7813.7059214903529,4533,2142,10958,-8816,4394,5197,null,null,31,52,858,413,null,150,295,null,null,null,295,4808,817,null,21,-80,257,4394,3539,495,360,21,null,47,1473,null,1.4486754966887416,11,1194.8404616429057,null,null,null,89,1955.193482688391,99.451277199621586,7175.831636116769,4521,2147,11278,-9131,4825,5096,null,null,21,119,871,511,48,0,408,0,0,0,408,5216,861,null,28,0,425,4825,3801,606,418,21,null,47,1453,null,{"$error":"#DIV/0!"},7.1887034659820284,1571.9201651754991,null,null,null,92.633120799586422,1956.6414315209911,91.904614294570905,7.7708189951823812,3278,1914,10626,-8712,4544,5227,null,null,21,20,1100,510,0,65,525,0,0,0,525,5742,1034,null,-109,0,462,4544,3570,550,424,21,null,26,4798,5199,5932,null,null,null,-696,1,135,-497,0,61,-665,65,28,null,null,600,-80,0,0,680,600,80,524,0,0,0,489,0,0,0,407,1551.5635395874915,999,801.10116999311765,170,116.99931176875431,null,null,-498,null,null,63,-63]
[47,"Enontekiö",1890,null,0.69130434782608696,39.554188192952921,-3064.5502645502643,null,null,null,49.060019495891936,121.16402116402116,4.2291540174053832,10457.142857142857,6973,2905,16911,-14006,5848,8474,null,null,-92,320,544,310,364,271,327,null,null,null,327,368,638,null,3,-828,-666,5848,4718,322,808,20.75,null,187,1861,null,0.443359375,42,-3372.3804406233207,null,null,null,47,171.95056421278881,5.8037267080745343,10814.078452444923,6877,2594,17332,-14738,6023,8833,null,null,-93,336,361,484,0,0,-123,0,0,0,-123,245,361,null,46,-1970,-472,6023,4863,338,822,20.75,null,239,1872,null,0.8007033997655334,39.205927266557325,-3087.0726495726494,null,null,null,49.133186571271324,113.78205128205128,3.9320756625531055,10.561965811965813,7098,2595,17380,-14785,6151,8935,null,null,1,299,601,382,0,0,219,0,0,0,219,464,601,null,-193,-771,340,6151,5003,326,822,21.25,null,196,7906,8321,8141,null,null,null,-1738,117,317,-934,101,0,-1267,1000,6,1631,-72,931,-653,0,440,5426,3542,1884,1682,5812,4581,1231,1682,5481,3810,1671,1682,5707.936507936508,6451,6236.6452991452988,235.43529411764706,125.76671694318753,null,null,-833,null,null,874,-874]
[49,"Espoo",265543,null,2.6137180208648978,35.244289662553435,945.20661437130707,null,null,null,81.114304500844156,2603.8193437597679,130.14047429476656,7302.8323096447657,627982,331138,1627818,-1296680,1332758,29769,null,null,12027,39224,117098,117578,null,null,-480,-33559,null,40096,6057,370844,90753,null,21375,-42541,-135014,1332758,1137028,121003,74727,18,null,96,269800,null,2.8346794278801681,49,67.813194959229065,null,null,null,75,2710.8747220163086,123.14575233828513,8034.9444032616757,631945,405147,1718159,-1313012,1393802,30083,null,null,10858,35309,154834,126686,0,0,28148,-30876,0,40102,37374,397468,120723,null,2947,-269272,-147671,1393802,1161281,136157,96364,18,null,49,274583,null,3.0600716124641196,59.640133706552163,-91.1782593969765,null,null,null,70.133055871697181,3274.5144455410568,162.01156262835298,7.3772374837480834,633118,399108,1735458,-1336350,1446482,60915,null,null,7554,20369,198970,138944,0,0,60026,12328,0,71,72425,469893,161398,null,-40873,-59738,-46438,1446482,1226153,120589,99740,18,null,30,713124,781379,792901,null,null,null,-320189,59875,34547,-358407,42985,47028,-286430,30125,48469,117000,-57479,51703,42360,270000,31369,355644,237688,117956,286474,615573,446609,168964,364890,857204,655965,201239,363246,8254.4107733963992,10000,11605.518185758039,68119.611111111109,248.08386211495653,null,null,-262144,null,null,55179,-55179]
[50,"Eura",12314,null,0.44450768355150827,47.471226064443364,-2539.3048562611662,null,null,null,49.141892911527854,181.01348059119701,9.3249701998899681,7085.2687997401326,35557,11074,77348,-66274,43027,23921,null,null,-224,82,532,2822,null,null,-2290,30,null,null,-2260,5796,457,null,655,-1508,-5874,43027,38582,2261,2184,20.5,null,285,12128,null,1.6308630393996248,49,-2818.024406332454,null,null,null,48,118.56860158311346,6.0400699670878506,7165.0725593667548,35543,11873,77842,-65969,45291,24045,null,null,-260,114,3195,3302,0,0,-107,28,0,0,-79,5717,2951,null,-283,-6329,-3210,45291,40489,2540,2262,20.5,null,199,12004,null,1.6334991708126037,50.625802714749803,-2945.0183272242584,null,null,null,47.336620326170831,132.70576474508496,6.9803834471829722,6.9391036321226256,35792,11379,75558,-64179,43653,24386,null,null,-250,45,3655,3174,0,0,481,26,0,0,507,6223,3506,null,560,-2127,-1471,43653,38341,2183,3129,20.5,null,207,30825,30966,28631,null,null,null,-7213,779,103,-7095,640,294,-5319,56,286,4487,4800,1850,-2600,219,4200,24752,12374,12378,4313,26631,16295,10336,3883,28923,14628,14295,3568,4125.9541984732823,4394,4501.4161946017994,1870.2926829268292,155.80578831446428,null,null,-6376,null,null,818,-818]
[51,"Eurajoki",5954,null,143.23255813953489,19.091255477233759,2721.0278804165268,null,null,null,88.751526083656884,4106.6509909304668,170.66231307606992,8783.0030231776946,17649,4795,41759,-36964,37951,9744,null,null,59,1497,12287,2648,137,null,9776,3,null,null,9779,66796,12223,null,397,-56,3343,37951,18189,4292,15470,18,null,2,5938,null,14.531390134529149,24,2284.6076119905692,null,null,null,88,3639.6092960592796,176.59234385493619,7522.7349275850447,18564,5310,42891,-37581,34546,8207,null,null,192,1096,6454,3314,0,0,3140,2,0,0,3142,69938,6264,null,-1563,0,-1866,34546,16365,2179,16002,18,null,3,9418,null,6.5469356089992239,21.589969423664929,2324.2174629324545,null,null,null,88.569825461395112,3835.9143327841844,155.7415382359948,8.98995057660626,18467,5351,44449,-39098,38041,8609,null,null,131,728,8411,3845,0,0,4566,2,0,0,4568,74506,8382,null,1283,-1261,1802,38041,18489,1426,18126,18,null,2,19970,20205,21605,null,null,null,-9328,null,448,-8648,0,518,-6785,0,205,null,-356,419,846,0,0,3398,2983,415,1280,3826,2565,1261,2049,2565,2143,422,3298,1028.8881424252602,950,608.56672158154856,1027.1666666666667,109.064203298648,null,null,-7328,null,null,701,-701]
[52,"Evijärvi",2651,null,4.682634730538922,27.953905249679899,437.57072802715959,null,null,null,70.965542560444746,2331.9502074688799,115.66097698498129,7359.1097698981512,4049,2274,17996,-15722,8849,8402,null,null,-29,22,1522,364,4982,null,6140,null,null,null,6140,4782,1323,null,-44,-293,5538,8849,7351,782,716,21.5,null,46,2576,null,2.0078125,28,448.75776397515529,null,null,null,72,2312.8881987577643,120.79486752207966,6988.7422360248447,3951,1851,18133,-16282,8877,7848,null,null,37,12,492,409,0,0,83,0,0,0,83,4866,485,null,19,0,-70,8877,7048,1099,730,21.5,null,243,2535,null,2.8166666666666669,28.896103896103895,319.52662721893495,null,null,null,71.414394651624363,2258.3826429980277,108.71007179273749,7.5826429980276133,3949,1780,18175,-16395,8615,8085,null,null,193,4,502,444,0,0,58,0,0,0,58,4924,502,null,-9,-175,-333,8615,6961,933,721,21.5,null,242,12654,12858,12869,375,null,null,-1177,null,5392,-574,0,19,-853,9,9,null,1100,234,-500,0,500,4409,175,4234,221,3675,0,3675,214,4000,0,4000,207,2514.1456054319128,2290,2449.7041420118344,323.76744186046511,127.71891197651483,null,null,-540,null,null,500,-500]
{"$rows_left_out":285}