{"text_format":"1","workbook":"xlsx","n_sheets":4,"sheets":["selite","KEHIKKO","pohjatiedot","väestöennuste"],"not_rendered":{"charts":2,"images":0,"macros":0,"external_links":1,"defined_names":3,"comments":0,"pivot_tables":0},"unopened":[],"bounds":{"document_bytes":16777216,"sheet_cells":100000,"rows_first":2000,"rows_last":500,"rows_between":2000,"halvings":0,"cell_chars":16384,"cell_head_chars":4096},"cells_cut":0,"cells_raw":0,"read":"whole","date_system":"1900"}

{"sheet":"selite","index":0,"n_rows":66,"n_cols":8,"rows_kept":66,"cut":false,"hidden":false,"merged":[]}
["VALTIOVARAINMINISTERIÖ/Kunta- ja aluehallinto-osasto/vjl",null,null,null,null,null,null,"2017-10-30"]
[]
["KUNNAN TALOUDEN SUUNNITTELUKEHIKKO"]
[]
["Kehikon käyttötarkoitus:"]
["Vuorovaikutteinen kunnan talouden suunnittelun apuväline. Kehikon avulla voidaan suunnitella kunnan talouden"]
["kehitystä pidemmällä aikavälillä. Tarkastelun kohteena ovat kunnan tuloslaskelma, rahoituslaskelmasta rahavarat, antolainat ja"]
["investoinnit sekä taseesta lainat ja kertynyt yli-/alijäämä. Pohjatietoina kehikossa ovat 2 viimeksi "]
["valmistunutta tilinpäätöstä. "]
["Tulevan kehityksen osalta tuloslaskelman erien kasvuolettamukset pohjautuvat lähtökohtaisesti"]
["uusimman valtion kuntatalousohjelman (elokuu 2017) mukaisiin makroarviolukuihin - ei kuntakohtaisiin ennusteisiin. "]
["Käyttäjä voi kuitenkin itse muokata em. kasvuolettamuksia sekä yleensä tuloslaskelman muita eriä."]
["Myös tuloveroprosenttia, investointeja ja antolainasaamisten määrää voidaan muuttaa."]
["Rahoituslaskelman ja taseen erät pohjautuvat jäljempänä selostettuihin olettamuksiin"]
["(pl. taseen kertynyt yli-/alijäämä = ed. tilikausien yli-/alijäämä + tilikauden yli-/alijäämä)."]
[]
["Käyttäjä voi muokata vaaleansinisellä pohjalla olevia kohtia (soluja)."]
[]
["Kehikon laskentapohja:"]
["Asukasluku:"]
{"$rows_left_out":47}
{"sheet":"KEHIKKO","index":1,"n_rows":117,"n_cols":16,"rows_kept":117,"cut":false,"hidden":false,"merged":[]}
["Valtiovarainministeriö/Kunta- ja aluehallinto-osasto/vjl",null,null,null,null,null,null,"VALITSE KUNTA:",null,null,null,"2017-10-30"]
["KUNNAN TALOUDEN SUUNNITTELUKEHIKKO",null,null,null,null,null,null,null,null,"Kunnat vuoden 2017 kuntajaolla"]
["Muokkaa vaaleansinisellä olevia kohtia."]
[{"$f":"INDEX(pohjatiedot!$B$3:$B$298,KEHIKKO!$A$5)","v":"KOKO MAA (Manner-Suomi)"}]
[96,"TP 2015","TP 2016",2017,2018,2019,2020,2021,2022,2023,2024,2025,2026]
["TULOSLASKELMA",null,null,null,null,null,null,null,null,null,"sama kuin ed.vuonna"]
["Asukasluku 31.12.",{"$f":"VLOOKUP($A$4,pohjatiedot!$B$3:$CC$298,2)","v":5458325},{"$f":"VLOOKUP($A$4,pohjatiedot!$B$3:$CC$298,40)","v":5474083},{"$f":"VLOOKUP($A$4,väestöennuste!$A$8:$K$305,4)","v":5482281},{"$f":"VLOOKUP($A$4,väestöennuste!$A$8:$K$305,5)","v":5503261},{"$f":"VLOOKUP($A$4,väestöennuste!$A$8:$K$305,6)","v":5524063},{"$f":"VLOOKUP($A$4,väestöennuste!$A$8:$K$305,7)","v":5544619},{"$f":"VLOOKUP($A$4,väestöennuste!$A$8:$K$305,8)","v":5564874},{"$f":"VLOOKUP($A$4,väestöennuste!$A$8:$K$305,9)","v":5584791},{"$f":"VLOOKUP($A$4,väestöennuste!$A$8:$K$305,10)","v":5604290},{"$f":"VLOOKUP($A$4,väestöennuste!$A$8:$K$305,11)","v":5623257},{"$f":"K7","v":5623257},{"$f":"L7","v":5623257},"Väestöennuste TK 2015"]
["Veroprosentti",{"$f":"VLOOKUP($A$4,pohjatiedot!$B$3:$CC$298,3)","v":19.850000000000001},{"$f":"VLOOKUP($A$4,pohjatiedot!$B$3:$CC$298,41)","v":19.89},{"$f":"VLOOKUP($A$4,pohjatiedot!$B$3:$CF$298,80)","v":19.920000000000002},{"$f":"D8","v":19.920000000000002},{"$f":"E8","v":19.920000000000002},{"$f":"VLOOKUP($A$4,pohjatiedot!$B$3:$CF$298,81)","v":7.4500000000000011},7.4500000000000011,7.4500000000000011,7.4500000000000011,7.4500000000000011,7.4500000000000011,7.4500000000000011,null,"Vuoden 2020 veroprosentti on saatu vähentämällä kunnilta 12,47 %-yksikköä"]
["vero-% yksikön tuotto",{"$f":"B15/B8","v":929129.42065491178},945567.82302664651,{"$f":"D15/D8","v":941785.55173453991},{"$f":"E15/E8","v":962504.83387269976},992342.48372275336,1225847.9961610537,1187846.7082800609,1151023.4603233791,1115341.7330533543,1080766.1393287003,1047262.3890095105,1014797.2549502156]
[" → noston vaikutus",null,null,{"$f":"(D8-C8)*C9","v":28367.034690800469},{"$f":"(E8-D8)*D9","v":0},null,-12374510.772022735,0,0,0,0,0,0]
["Toimintatuotot (sis. valm. okäytt.)",{"$f":"VLOOKUP($A$4,pohjatiedot!$B$3:$CC$298,6)","v":8030301},{"$f":"VLOOKUP($A$4,pohjatiedot!$B$3:$CC$298,44)","v":8072125},{"$f":"C11*(1+D69/100)","v":7757312.125},{"$f":"D11*(1+E69/100)","v":7819370.6220000004},{"$f":"E11*(1+F69/100)","v":7952299.9225739995},{"$f":"F11*(1+G69/100)","v":6345935.3382140519},{"$f":"G11*(1+H69/100)","v":6510929.6570076169},6680213.8280898156,6853899.387620151,7032100.7716982756,7214935.3917624308,7402523.7119482541,null,"Näiden erin muutos-"]
["Toimintakulut",{"$f":"VLOOKUP($A$4,pohjatiedot!$B$3:$CC$298,7)","v":36335521},{"$f":"VLOOKUP($A$4,pohjatiedot!$B$3:$CC$298,45)","v":36517141},{"$f":"C12*(1+D70/100)","v":35604212.475000001},35995858.812224999,36751771.847281724,17824609.345931634,18288049.188925859,18763538.46783793,19251390.468001716,19751926.620169763,20265476.712294176,20792379.106813826,null,"prosentit syötetään"]
["Kotikuntakorv.+elatustuen pal., netto",null,null,{"$f":"VLOOKUP($A$4,pohjatiedot!$B$3:$CQ$298,92)","v":0},{"$f":"D13","v":0},{"$f":"E13","v":0},0,0,0,0,0,0,0,null,"alla olevaan taulukkoon"]
["Toimintakate",{"$f":"B11-B12","v":-28305220},{"$f":"C11-C12","v":-28445016},{"$f":"D11-D12+D13","v":-27846900.350000001},{"$f":"E11-E12+E13","v":-28176488.190224998},-28799471.924707726,-11478674.007717583,-11777119.531918243,-12083324.639748115,-12397491.080381565,-12719825.848471487,-13050541.320531745,-13389855.394865572,null,"pl. kotikuntakorv.+elatustuki"]
["Kunnallisverot",{"$f":"VLOOKUP($A$4,pohjatiedot!$B$3:$CC$298,9)","v":18443219},{"$f":"VLOOKUP($A$4,pohjatiedot!$B$3:$CC$298,47)","v":18807344},{"$f":"(C15+D10)*(1+D71/100)","v":18760368.190552037},{"$f":"(D15+E10)*(1+E71/100)","v":19173096.290744182},{"$f":"(E15+F10)*(1+F71/100)","v":19767462.275757249},{"$f":"F15*(1+G71/100)","v":9132567.5713998508},{"$f":"(G15+H10)*(1+H71/100)","v":8849457.9766864553},8575124.7794091757,8309295.9112474909,8051707.737998818,7802104.7981208544,7560239.5493791075]
["Yhteisöverot  ",{"$f":"VLOOKUP($A$4,pohjatiedot!$B$3:$CC$298,10)","v":1638497},{"$f":"VLOOKUP($A$4,pohjatiedot!$B$3:$CC$298,48)","v":1539341},{"$f":"C16*(1+D72/100)","v":1898007.4530000002},{"$f":"D16*(1+E72/100)","v":1930273.5797010001},1984321.2399326281,1623174.77426489,1485204.9184523744,1358962.5003839226,1243450.6878512893,1137757.3793839298,1041048.0021362958,952558.92195471062]
["Kiinteistöverot",{"$f":"VLOOKUP($A$4,pohjatiedot!$B$3:$CC$298,11)","v":1581155},{"$f":"VLOOKUP($A$4,pohjatiedot!$B$3:$CC$298,49)","v":1640918},{"$f":"C17*(1+D73/100)","v":1721322.9819999998},1779847.9633879999,1836803.0982164158,1860681.5384932291,1881149.0354166543,1901841.6748062372,1922761.9332291055,1943912.3144946254,1965295.3499540661,1986913.5988035607]
["Verotulot",{"$f":"VLOOKUP($A$4,pohjatiedot!$B$3:$CC$298,12)","v":21662871},{"$f":"VLOOKUP($A$4,pohjatiedot!$B$3:$CC$298,50)","v":21987603},{"$f":"SUM(D15:D17)","v":22379698.62555204},22883217.83383318,23588586.61390629,12616423.884157971,12215811.930555485,11835928.954599336,11475508.532327885,11133377.431877373,10808448.150211217,10499712.07013738]
["Valtionosuudet",{"$f":"VLOOKUP($A$4,pohjatiedot!$B$3:$CC$298,13)","v":8196322},{"$f":"VLOOKUP($A$4,pohjatiedot!$B$3:$CC$298,51)","v":8792091},{"$f":"VLOOKUP($A$4,pohjatiedot!$B$3:$CQ$298,88)","v":8501912.9869393446},{"$f":"VLOOKUP($A$4,pohjatiedot!$B$3:$CQ$298,89)","v":8201794.8606081046},{"$f":"E19*(1+F74/100)","v":7881924.8610443883},{"$f":"F19*(1+G74/100)","v":2309403.9842860051},2380995.507798871,2454806.3685406358,2530905.3659653952,2609363.4323103223,2690253.698711942,2773651.5633720118]
[null,null,null,null,null,"Kuntatalousohjelma-->"]
{"$rows_left_out":98}
{"sheet":"pohjatiedot","index":2,"n_rows":298,"n_cols":100,"rows_kept":298,"cut":false,"hidden":false,"merged":[]}
[null,null,2015,41,42,43,44,45,46,47,48,49,50,51,52,53,54,55,56,57,58,59,60,61,62,63,64,65,66,67,68,69,70,71,72,73,74,75,76,77,2016,41,42,43,44,45,46,47,48,49,50,51,52,53,54,55,56,57,58,59,60,61,62,63,64,65,66,67,68,69,70,71,72,73,74,75,76,77,78,"vero-%","vero-%",12.47,null,null,2016,2016,2010,85,2017,2018,89,90,91,92,2013,2016,2016,90,91,2015]
["Kunta nro.","Kunta","Asukasluku ","Veroprosentti","vero-% yksikön tuotto"," -> noston vaikutus","Toimintatuotot","Toimintakulut","Toimintakate","Kunnallisverot","Yhteisöverot","Kiinteistöverot","Verotulot","Valtionavut","Korkotuotot","Korkokulut","Muut rahoitustuotot","Muut rahoituskulut","VUOSIKATE"," €/as","Poistot ja arvonalent.","Satu. tuotot","Satu. kulut","Tlikauden tulos","Poistoeron lisäys(-) tai väh.(+)","Varausten lisäys(-) tai väh.(+)","Rahastojen lisäys(-) tai väh.(+)","Tlikauden yli-/alijäämä","€/as","Kertynyt yli-/alijäämä","€/as",null,"Nettoinv.","Vuosikate-nettoinv.","€/as","Rahavarat (ent. kassavarat)","€/as","Lainakanta ","€/as","Saamiset","Asukasluku","Veroprosentti","vero-% yksikön tuotto"," -> noston vaikutus","Toimintatuotot","Toimintakulut","Toimintakate","Kunnallisverot","Yhteisöverot","Kiinteistöverot","Verotulot","Valtionavut","Korkotuotot","Korkokulut","Muut rahoitustuotot","Muut rahoituskulut","VUOSIKATE"," €/as","Poistot ja arvonalent.","Satu. tuotot","Satu. kulut","Tlikauden tulos","Poistoeron lisäys(-) tai väh.(+)","Varausten lisäys(-) tai väh.(+)","Rahastojen lisäys(-) tai väh.(+)","Tlikauden yli-/alijäämä","€/as","Kertynyt yli-/alijäämä","€/as",null,"Nettoinv.","Vuosikate-nettoinv.","€/as","Rahavarat ","€/as","Lainakanta ","€/as","Saamiset",null,null,2017,2020,null,null,"vos-hava","hava","vos-hava","Harkvar10","Valtionosuudet","Valtionosuudet",null,null,null,"vos-hava 2015","Kotikuntakorv+elatustuen palautus, netto","Tulorah.korjauserät","Investointimenot","Rahoitusos. inv.menoihin","Inv.hyödyk. luovutustulot","antolainauksen muutokset"]
[20,"Akaa",17043,21.25,null,null,22841,110377,-87536,54123,1775,3194,59092,29881,364,582,253,213,1229,null,4203,0,0,-2974,31,0,0,-2943,null,-8186,null,null,-7351,null,null,2002,null,59953,null,null,16923,21.25,null,null,22331,109001,-86670,55165,1606,3377,60148,31248,359,522,206,2,4767,null,4712,0,0,55,29,0,0,84,null,-8105,null,null,null,null,null,4160,null,57802,null,null,null,null,21.25,{"$f":"CC3-$CD$1","v":8.7799999999999994},null,null,null,null,27814,0,30572.896963830583,29351.912102991082,null,{"$f":"CL3-CM3","v":29351.912102991082},null,{"$f":"N3-CO3","v":29881},-322.96222939400002,-165,-2583,394,262,0]
[5,"Alajärvi",10006,21.5,null,null,41661,98986,-57325,24150,2048,2256,28454,34084,9,324,202,3,5024,null,3095,0,0,1929,0,0,0,1929,null,-2000,null,null,-1694,null,null,3969,null,24115,null,null,9899,22,null,null,41721,97917,-56196,25084,2039,2313,29436,36984,16,270,174,90,10054,null,3035,0,0,7019,0,0,0,7019,null,5020,null,null,null,null,null,4284,null,18695,null,null,null,null,21.75,{"$f":"CC4-$CD$1","v":9.2799999999999994},null,null,null,null,30121,0,35696.984931790576,34318.375302499961,null,{"$f":"CL4-CM4","v":34318.375302499961},null,{"$f":"N4-CO4","v":34084},4798.4155228000009,-145,-5261,134,1630,16]
[9,"Alavieska",2687,21.5,null,null,2108,17064,-14956,7099,285,408,7792,8552,0,58,15,9,1336,null,795,0,0,541,0,0,0,541,null,-1422,null,null,-573,null,null,1238,null,11124,null,null,2639,21.5,null,null,2175,17327,-15152,6892,271,522,7685,8869,0,49,15,11,1357,null,811,681,0,1227,0,0,0,1227,null,-195,null,null,null,null,null,866,null,10399,null,null,null,null,21.5,9.0299999999999994,null,null,null,null,7636,0,8918.4021211721301,8666.7788811986575,null,8666.7788811986575,null,{"$f":"N5-CO5","v":8552},-54.915172200000015,3,-576,6,265,0]
[10,"Alavus",12044,20.75,null,null,15659,86214,-70555,29182,2245,2588,34015,37398,274,281,1312,4,1584,null,2982,0,0,-1398,0,0,0,-1398,null,11384,null,null,-4678,null,null,11172,null,34138,null,null,11907,21.25,null,null,12121,81749,-69628,29668,2203,2611,34482,38870,120,115,1013,75,4667,null,3133,0,0,1534,0,0,0,1534,null,12918,null,null,null,null,null,12694,null,38719,null,null,null,null,21.25,8.7799999999999994,null,null,null,null,24410,0,38667.828399451791,37624.463588470207,null,37624.463588470207,null,37398,-117.78744078000003,-262,-5693,285,1903,-425]
[16,"Asikkala",8287,20.75,null,null,6847,49270,-42423,25339,1538,2501,29378,16868,4,82,111,174,3654,null,2039,0,0,1615,94,0,0,1709,null,9156,null,null,-892,null,null,654,null,17046,null,null,8323,20.75,null,null,6668,48906,-42238,25836,1430,2659,29925,17906,2,52,280,395,5428,null,2164,0,0,3264,94,-2000,0,1358,null,10514,null,null,null,null,null,322,null,15016,null,null,null,null,20.75,8.2799999999999994,null,null,null,null,15106,0,17874.508686845202,17540.251548889391,null,17540.251548889391,null,16868,405.30136615999982,-97,-2644,178,211,15]
[18,"Askola",5104,20.25,null,null,4397,29519,-25122,16391,987,1052,18430,6844,0,137,501,13,290,null,1103,0,0,-813,0,0,0,-813,null,-569,null,null,-2364,null,null,1297,null,16221,null,null,5046,20.25,null,null,4436,29873,-25437,17262,868,1044,19174,7136,0,140,262,12,983,null,1213,0,0,-230,0,0,0,-230,null,-799,null,null,null,null,null,1190,null,16573,null,null,null,null,20.75,8.2799999999999994,null,null,null,null,5973,0,7397.7858976601101,7458.1080757415002,null,7458.1080757415002,null,6844,582.89778020000017,-153,-1534,0,244,0]
[19,"Aura",3986,21,null,null,3226,21799,-18573,12633,506,736,13875,5377,0,64,25,3,634,null,784,0,0,-150,28,0,0,-122,null,-2956,null,null,-1550,null,null,494,null,14585,null,null,3984,21.75,null,null,3073,21803,-18730,13272,758,410,14440,6032,0,34,9,2,1715,null,724,0,0,991,28,0,0,1019,null,-1937,null,null,null,null,null,369,null,13280,null,null,null,null,21.75,9.2799999999999994,null,null,null,null,4924,0,5986.1344989335448,5584.2465923015225,null,5584.2465923015225,null,5377,-121.37373774000001,-7,-719,0,41,0]
[46,"Enonkoski",1473,21,null,null,2147,11278,-9131,3801,606,418,4825,5096,25,4,119,0,871,null,511,48,0,408,0,0,0,408,null,5216,null,null,-436,null,null,2880,null,0,null,null,1453,21,null,null,1914,10626,-8712,3570,550,424,4544,5227,21,0,20,0,1100,null,510,0,65,525,0,0,0,525,null,5742,null,null,null,null,null,2843,null,0,null,null,null,null,21,8.5299999999999994,null,null,null,null,4469,0,5272.4930687586148,5110.4539175955097,null,5110.4539175955097,null,5096,128.25992600000001,-1,-665,65,28,82]
[47,"Enontekiö",1861,20.75,null,null,2594,17332,-14738,4863,338,822,6023,8833,0,93,503,167,361,null,484,0,0,-123,0,0,0,-123,null,245,null,null,-833,null,null,320,null,5812,null,null,1872,21.25,null,null,2595,17380,-14785,5003,326,822,6151,8935,83,82,571,272,601,null,382,0,0,219,0,0,0,219,null,464,null,null,null,null,null,213,null,5481,null,null,null,null,21.25,8.7799999999999994,null,null,null,null,7672,0,8847.6778030030855,8708.0230920612867,null,8708.0230920612867,null,8833,-10.086460199999998,0,-1267,1000,6,0]
[49,"Espoo",269802,18,null,null,405147,1718159,-1313012,1161281,136157,96364,1393802,30083,15367,4509,48979,13670,154834,null,126686,0,0,28148,-30876,0,40102,37374,null,397468,null,null,-268394,null,null,731394,null,615573,null,null,274583,18,null,null,399108,1735458,-1336350,1226153,120589,99740,1446482,60915,15402,7848,23174,2805,198970,null,138944,0,0,60026,12328,0,71,72425,null,469893,null,null,null,null,null,899126,null,857204,null,null,null,null,18,5.5299999999999994,null,null,null,null,24390,0,35423.51400928435,29148.660299252388,null,29148.660299252388,null,30083,-12421.988776004002,-37572,-286430,30125,48469,1644]
[50,"Eura",12128,20.5,null,null,11873,77842,-65969,40489,2540,2262,45291,24045,22,282,118,4,3195,null,3302,0,0,-107,28,0,0,-79,null,5717,null,null,-6161,null,null,1438,null,26631,null,null,12004,20.5,null,null,11379,75558,-64179,38341,2183,3129,43653,24386,35,285,53,8,3655,null,3174,0,0,481,26,0,0,507,null,6223,null,null,null,null,null,1593,null,28923,null,null,null,null,20.5,8.0299999999999994,null,null,null,null,22268,0,23934.034289951676,22959.415180906744,null,22959.415180906744,null,24045,68.71245356,-149,-5319,56,286,315]
[51,"Eurajoki",5938,18,null,null,5310,42891,-37581,16365,2179,16002,34546,8207,219,27,2793,1697,6454,null,3314,0,0,3140,2,0,0,3142,null,69938,null,null,-8130,null,null,21612,null,3826,null,null,9418,18,null,null,5351,44449,-39098,18489,1426,18126,38041,8609,159,28,1124,396,8411,null,3845,0,0,4566,2,0,0,4568,null,74506,null,null,null,null,null,23284,null,2565,null,null,null,null,18,5.5299999999999994,null,null,null,null,5750,0,13206.549841220543,11167.549277070151,null,11167.549277070151,null,8207,-34.227966854000002,-29,-6785,0,205,-1250]
[52,"Evijärvi",2576,21.5,null,null,1851,18133,-16282,7048,1099,730,8877,7848,59,22,14,2,492,null,409,0,0,83,0,0,0,83,null,4866,null,null,-555,null,null,5958,null,3675,null,null,2535,21.5,null,null,1780,18175,-16395,6961,933,721,8615,8085,198,5,18,14,502,null,444,0,0,58,0,0,0,58,null,4924,null,null,null,null,null,5725,null,4000,null,null,null,null,21.5,9.0299999999999994,null,null,null,null,7542,0,8103.2899261589409,8180.3979916942644,null,8180.3979916942644,null,7848,57.281132000000014,0,-853,9,9,7]
[61,"Forssa",17422,20,null,null,17993,110529,-92536,51849,3453,4376,59678,39859,24,499,178,4,6644,null,5985,0,0,659,113,0,0,772,null,8558,null,null,-8022,null,null,16917,null,44486,null,null,17332,20,null,null,18421,111586,-93165,51886,3143,5379,60408,41928,12,258,183,4,9104,null,6024,0,0,3080,111,-3000,0,191,null,8750,null,null,null,null,null,17548,null,44959,null,null,null,null,20.5,8.0299999999999994,null,null,null,null,30500,0,40176.394675010488,39480.900657952698,null,39480.900657952698,null,39859,221.44138486000003,-1668,-7700,20,73,123]
[69,"Haapajärvi",7438,22,null,null,5134,49804,-44670,20055,1353,1843,23251,23465,8,437,1767,171,3213,null,1625,0,0,1588,85,0,0,1673,null,-2,null,null,-1520,null,null,14671,null,29907,null,null,7332,22,null,null,5222,51501,-46279,19865,1382,1889,23136,23805,5,395,1058,167,1163,null,1732,0,259,-828,85,0,0,-743,null,-746,null,null,null,null,null,13913,null,32615,null,null,null,null,22,9.5299999999999994,null,null,null,null,21546,0,23664.460169336282,23000.310845673146,null,23000.310845673146,null,23465,66.495922799999974,119,-4183,479,61,7]
[71,"Haapavesi",7167,21.25,null,null,34211,76618,-42407,18583,1218,1399,21200,22107,65,295,912,112,1332,null,2399,0,19,-1086,0,0,0,-1086,null,-1410,null,null,-2906,null,null,8204,null,25987,null,null,7098,22,null,null,34900,78239,-43339,18139,1146,1521,20806,22953,52,214,778,181,855,null,2405,0,0,-1550,0,0,0,-1550,null,-2961,null,null,null,null,null,8049,null,27774,null,null,null,null,22,9.5299999999999994,null,null,null,null,19865,0,24033.385262004795,23689.694250044173,null,23689.694250044173,null,22107,12.203371600000013,92,-3625,1991,40,14]
[72,"Hailuoto",993,20,null,null,1467,7814,-6347,3048,94,291,3433,3397,4,10,58,1,533,null,415,0,0,118,0,124,0,242,null,2359,null,null,-396,null,null,3076,null,1961,null,null,994,20,null,null,1595,7942,-6347,2916,93,326,3335,3345,14,19,2,1,329,null,403,0,0,-74,-388,922,0,460,null,2851,null,null,null,null,null,2244,null,2508,null,null,null,null,20,7.5299999999999994,null,null,null,null,3147,0,3476.3868461876737,3281.9833900359199,null,3281.9833900359199,null,3397,0,-30,-1234,246,59,0]
[74,"Halsua",1225,21.5,null,null,890,8383,-7493,3114,428,295,3837,3645,0,49,1,0,-59,null,119,0,0,-178,0,0,0,-178,null,321,null,null,-322,null,null,189,null,3708,null,null,1219,21.5,null,null,918,8466,-7548,2891,315,443,3649,3921,0,29,3,0,-4,null,133,0,0,-137,0,0,0,-137,null,184,null,null,null,null,null,11,null,4054,null,null,null,null,22,9.5299999999999994,null,null,null,null,3768,0,4156.0472573350735,4173.2283887804433,null,4173.2283887804433,null,3645,22.414356000000002,-28,-311,0,41,-10]
{"$rows_left_out":279}
{"sheet":"väestöennuste","index":3,"n_rows":303,"n_cols":11,"rows_kept":303,"cut":false,"hidden":false,"merged":[]}
["Väestöennuste 2015 kunnittain 2017-2024"]
["TK, 28.9.2015"]
["2017 kuntajako",3,4,6,7,8,9,10,11,12,13]
[]
[null,2015,2016,2017,2018,2019,2020,2021,2022,2023,2024]
[]
[]
["Akaa",{"$f":"pohjatiedot!C3","v":17043},{"$f":"pohjatiedot!AO3","v":16923},17070,17092,17116,17150,17184,17218,17248,17275]
["Alajärvi",{"$f":"pohjatiedot!C4","v":10006},{"$f":"pohjatiedot!AO4","v":9899},10001,9923,9845,9769,9697,9629,9560,9499]
["Alavieska",{"$f":"pohjatiedot!C5","v":2687},{"$f":"pohjatiedot!AO5","v":2639},2650,2631,2615,2599,2586,2572,2560,2549]
["Alavus",{"$f":"pohjatiedot!C6","v":12044},{"$f":"pohjatiedot!AO6","v":11907},11877,11780,11689,11605,11527,11454,11384,11319]
["Asikkala",{"$f":"pohjatiedot!C7","v":8287},{"$f":"pohjatiedot!AO7","v":8323},8294,8262,8239,8219,8200,8184,8172,8159]
["Askola",{"$f":"pohjatiedot!C8","v":5104},{"$f":"pohjatiedot!AO8","v":5046},5169,5220,5270,5320,5365,5410,5449,5490]
["Aura",{"$f":"pohjatiedot!C9","v":3986},{"$f":"pohjatiedot!AO9","v":3984},4035,4058,4079,4099,4118,4134,4152,4168]
["Enonkoski",{"$f":"pohjatiedot!C10","v":1473},{"$f":"pohjatiedot!AO10","v":1453},1462,1445,1430,1416,1401,1388,1375,1363]
["Enontekiö",{"$f":"pohjatiedot!C11","v":1861},{"$f":"pohjatiedot!AO11","v":1872},1896,1902,1910,1917,1926,1936,1945,1956]
["Espoo",{"$f":"pohjatiedot!C12","v":269802},{"$f":"pohjatiedot!AO12","v":274583},273484,277445,281312,285087,288763,292333,295784,299117]
["Eura",{"$f":"pohjatiedot!C13","v":12128},{"$f":"pohjatiedot!AO13","v":12004},12205,12166,12127,12091,12059,12028,11995,11960]
["Eurajoki",{"$f":"pohjatiedot!C14","v":5938},{"$f":"pohjatiedot!AO14","v":9418},5964,5972,5984,5995,6007,6016,6024,6029]
["Evijärvi",{"$f":"pohjatiedot!C15","v":2576},{"$f":"pohjatiedot!AO15","v":2535},2596,2571,2548,2528,2510,2492,2474,2458]
{"$rows_left_out":283}