{"text_format":"1","workbook":"xlsx","n_sheets":2,"sheets":["Kuntakortti","Luvut"],"not_rendered":{"charts":1,"images":0,"macros":1,"external_links":0,"defined_names":2,"comments":0,"pivot_tables":0},"unopened":[],"bounds":{"document_bytes":16777216,"sheet_cells":100000,"rows_first":2000,"rows_last":500,"rows_between":2000,"halvings":0,"cell_chars":16384,"cell_head_chars":4096},"cells_cut":0,"cells_raw":0,"read":"whole","date_system":"1900"}

{"sheet":"Kuntakortti","index":0,"n_rows":83,"n_cols":20,"rows_kept":83,"cut":false,"hidden":false,"merged":[[1,6,1,7]]}
["Valtiovarainministeriö/Kunta- ja aluehallinto-osasto, 7.10.2022"]
["KUNTIEN LOPULLISET TP:T 2019 - 2020 ja TP 2021",null,null,null,null,null,"Valitse kunta valikosta:"]
[null,null,null,null,null,null,null," "]
[{"$f":"INDEX(Luvut!$B$3:'Luvut'!$B$296,$A$7)","v":"KOKO MAA (Manner-Suomi)"},null,null,2019,null,null,2020,null,null,2021]
[]
["Asukasluku",null,null,{"$f":"VLOOKUP($A$4,Luvut!$B$3:$AT$296,2)","v":5495408},null,null,{"$f":"VLOOKUP($A$4,Luvut!$B$3:$ED$296,46)","v":5503664}," ",{"$f":"((G6/D6)-1)*100","v":0.15023452307818541},{"$f":"VLOOKUP($A$4,Luvut!$B$3:$ED$296,90)","v":5517897}," ",{"$f":"((J6/G6)-1)*100","v":0.25860953721013047},null,null,null,null,"Kunta"]
[95,null,null," ",null,null,null,null,null,null,null,null,null,null,null,null,null,2019,2020,2021]
["Tunnuslukuja",null,null," ",null,null,null,null,null,null,null,null,null,null,null,null,"Vuosikate",{"$f":"D36","v":1747616},{"$f":"G36","v":4072986},{"$f":"J36","v":3786456.8943100246}]
[null,null,null," "," "," "," ",null,"muutos%"," ",null,"muutos%",null,"Konsernivelka, €","Konsernivelka, €","Konsernivelka, €","Poistot",{"$f":"D38","v":2305725},{"$f":"G38","v":2397525},{"$f":"J38","v":2411475}]
["Lainat, euro/as",null,null,{"$f":"E67","v":3351.8961649435309}," ",null,{"$f":"H67","v":3458.3115902424274},null,{"$f":"((G10/D10)-1)*100","v":3.1747828710168013},{"$f":"K67","v":3465.7604156076127},null,{"$f":"((J10/G10)-1)*100","v":0.21538907558826814},null,2019,2020,2021,"Tilikauden tulos",{"$f":"D41","v":-164092},{"$f":"G41","v":1756705},{"$f":"J41","v":1485638.6467899999}]
{"$rows_left_out":74}
{"sheet":"Luvut","index":1,"n_rows":296,"n_cols":179,"rows_kept":296,"cut":false,"hidden":false,"merged":[]}
[null,null,2019,null,92,93,94,95,96,97,98,99,100,101,102,103,104,105,106,107,108,null,110,111,112,113,114,115,116,117,118,119,120,121,122,null,124,125,126,127,128,129,130,131,132,133,2020,null,92,93,94,95,96,97,98,99,100,101,102,103,104,105,106,107,108,109,110,111,112,113,114,115,116,117,118,119,120,121,122,123,124,125,126,127,128,129,130,131,132,133,2021,null,92,93,94,95,96,97,98,99,100,101,102,103,104,105,106,107,108,"summana",110,111,112,113,114,115,116,117,118,119,120,121,122,123,124,125,126,127,128,129,130,131,132,133,"Erillistiedot",135,136,137,138,139,2019,144,145,2020,147,148,2021,147,148,2019,152,2020,154,2021,null,2019,160,161,162,2020,164,165,166,2021,164,165,166,2019,2020,2021,"Yhden vero%:n","Yhden vero%:n"]
["Kunta nro","Kunta","Asukasluku ",null,"Lainanhoitokate","Suhteellinen velkaantuneisuus-%","Rahoitusvarallisuus, e/as",null,null,null,"Omavaraisuusaste, %","Rahavarat e/as","Kassan riittävyys, pv","Kassasta maksut, €/as","Henkilöstökulut","Toimintatuotot","Toimintakulut","Toimintakate","Verotulot","Valtionosuudet","Alv-takaisinperintä",null,"Korkotuotot/-menot, netto","Muut rahoitustuotot/-menot, netto (sis Osinkotuotot)","Vuosikate","Suunnitelman mukaiset poistot ja arvonalet","Satunnaiset tuotot","Satunnaiset kulut","Tilikauden tulos","Poistoeron lisäys(-) tai vähennys(+)","Varausten lisäys(-) tai vähennys(+)","Rahastojen lisäys(-) tai vähennys(+)","Tilikauden yli- tai alijäämä","Kumulat yli/alij","Tulorah (toiminnan rahavirta)",null,"Saamisten muutos ","Pitkäaikaisten lainojen vähennys","Toim ja inv rahavirta","Verotulot","Kunnallisvero","Osuus yhteisöveron tuotosta","Kiinteistövero","Tuloveroprosentti",null,"Sijoitus vuosikatteen mukaan","Asukasluku ",null,"Lainanhoitokate","Suht. velkaantuneisuus-%","Rahoitusvarallisuus, e/as",null,null,null,"Omavaraisuusaste, %","Rahavarat e/as","Kassan riittävyys, pv","Kassasta maksut, €/as","Henkilöstökulut","Toimintatuotot","Toimintakulut","Toimintakate","Verotulot","Valtionosuudet",null,null,"Korkotuotot/-menot, netto","Muut rahoitustuotot/-menot, netto (sis Osinkotuotot)","Vuosikate","Suunnitelman mukaiset poistot ja arvonalet","Satu. tuotot","Satu. kulut","Tilikauden tulos","Poistoeron lisäys(-) tai vähennys(+)","Varausten lisäys(-) tai vähennys(+)","Rahastojen lisäys(-) tai vähennys(+)","Tilikauden yli- tai alijäämä","Kumulat yli/alij","Toiminnan rahavirta",null,"Saamisten muutos ","Pitkäaikaisten lainojen vähennys","Toim ja inv rahavirta","Verotulot","Kunnallisvero","Osuus yhteisöveron tuotosta","Kiinteistövero","Tuloveroprosentti ",null,"Sijoitus vuosikatteen mukaan","Asukasluku",null,"Lainanhoitokate","Suht. velkaantuneisuus-%","Rahoitusvarallisuus, e/as",null,null,null,"Omavaraisuusaste, %","Rahavarat e/as","Kassan riittävyys, pv","Kassasta maksut, €/as","Henkilöstökulut","Toimintatuotot","Toimintakulut","Toimintakate","Verotulot","Valtionosuudet","Alv-takaisinperintä","Käyttökate","Korkotuotot/-menot, netto","Muut rahoitustuotot/-menot, netto (sis Osinkotuotot)","Vuosikate","Suunnitelman mukaiset poistot ja arvonalet","Satu. tuotot","Satu. kulut","Tilikauden tulos","Poistoeron lisäys(-) tai vähennys(+)","Varausten lisäys(-) tai vähennys(+)","Rahastojen lisäys(-) tai vähennys(+)","Tilikauden yli- tai alijäämä","Kumulat yli/alij","Toiminnan rahavirta",null,"Saamisten muutos ","Pitkäaikaisten lainojen vähennys","Toim ja inv rahavirta","Verotulot","Kunnallisvero","Osuus yhteisöveron tuotosta","Kiinteistövero","Tuloveroprosentti ",null,"Sijoitus vuosikatteen mukaan","Palvelujen ostot 2019","Palvelujen ostot 2020","Palvelujen ostot 2021","Harkvar2019","Harkvar2020","Harkvar2021"," - Investointimenot"," + Rahoitusos. investointimenoihin"," + Investointihyödykk. luovutustulot"," - Investointimenot"," + Rahoitusosuudet investointimenoihin"," + Investointihyödykkeiden luovutustulot"," - Investointimenot"," + Rahoitusosuudet investointimenoihin"," + Investointihyödykkeiden luovutustulot","Pitkäaikaisten lainojen lisäys"," ± Lyhytaikaisten lainojen muutos","Pitkäaikaisten lainojen lisäys"," ± Lyhytaikaisten lainojen muutos","Pitkäaikaisten lainojen lisäys"," ± Lyhytaikaisten lainojen muutos","Lainakanta","josta pitkäaik","josta lyhytaik","Lainasaamiset","Lainakanta","josta pitkäaik","josta lyhytaik","Lainasaamiset","Lainakanta","josta pitkäaik","josta lyhytaik","Lainasaamiset","Konsernilainat €/as","Konsernilainat €/as","Konsernilainat €/as","tuotto","tuotto, €/as"]
[20,"Akaa",16475,null,0.80323175774540367,59.075532601678503,-3668.7101669195749,null,null,null,25.899652860130661,178.69499241274659,8.8358974780656681,7381.6691957511384,44817,21733,110542,-88791,62993,31449,null,null,85,321,6057,6043,0,0,14,26,0,0,40,-8846,5908,null,-1750,-5507,778,62993,57840,1596,3557,22.25,null,66,16391,null,3.2927056196501674,54.56404061055224,-3487.7066682935756,null,null,null,33.645378594008733,528.5827588310658,23.687735015205764,8144.8355805014944,44739,28305,112143,-83838,64150,36698,null,null,99,378,17487,5748,0,0,11739,20,0,0,11757,2911,12838,null,620,-5166,3234,64150,59104,1773,3273,22.25,null,22.794117647058901,16467,null,5.4305823132944706,70.206493812349166,-4418.7429434626838,null,null,null,28.327995958111888,543.04075545029445,22.949373725818916,8636.8315801299559,46010.27304,24031.753720000004,121903.69687999999,-97871.943159999995,66852.587299999999,34427.230000000003,null,null,-441.56817000000007,389.65987000000001,3355.9658400000008,4349.0901100000001,0,0,-993.12426999999957,-3.1373800000000003,0,0,-989.98689000000002,1921.4892799999998,3109.88267,null,-1668.9309800000001,4894,-15571.872880000001,66852.587299999999,60897.137590000006,2439.1327299999998,3516.3169800000001,22.25,null,21,49394,50719,60800.32692,1000,null,1250,-5323,34,159,-16001,115,6282,-19554.5867,561.11209999999994,311.71904999999998,0,5020,12000,-8000,0,16114.409180000001,53609,33398,20211,7639,52444,40805,11639,7647,68557.508930000011,37055.36881,31502.14012,7235.2380700000003,4463.186646433991,4623.2078579708377,5830.3321193902948,{"$f":"(DY3/EB3)","v":2736.9500040449439},{"$f":"(FO3/CM3)*1000","v":166.20817416924419},null,null,null,null,null,4670,{"$f":"FV3*-1","v":-4670}]
[5,"Alajärvi",9562,null,0.34200108228190595,38.199113867153457,-3405.7728508680193,null,null,null,43.140005395198273,352.54130934950842,10.292828401970873,12501.673290106672,45948,44709,107678,-62969,29512,34792,null,null,-202,150,1283,3246,0,0,-1963,0,0,0,-1963,5768,1301,null,125,-3838,-5586,29512,25292,2066,2154,21.75,null,162,9419,null,1.3470940959409594,37.566943096129393,-3337.7216264996282,null,null,null,44.059835142794292,478.6070708143115,14.18013219921232,12319.460664614078,45160,43439,106079,-62640,29583,38640,null,null,-186,252,5649,3584,0,0,2065,0,0,0,2065,7833,5646,null,-298,-4144,322,29583,25512,2144,1927,21.75,null,184.97794117647001,9311,null,1.0882863891193786,37.693969918597332,-3390.6536440768982,null,null,null,43.679848812022492,514.54376329073148,14.548999473169937,12908.686535280851,46534.569670000004,47201.90683,111541.31578,-64339.408950000005,31473.606629999998,37501.948039999996,null,null,-120.57539,170.04986,4685.6201899999951,3827.3159300000002,0,0,858.30425999999466,0,0,0,858.30426,8691.0721200000007,4719.1541500000003,null,-1427.7840900000001,4294.4219999999996,726.39552000000003,31473.606629999998,26214.4548,3078.7167300000001,2180.4351000000001,21.75,null,114,49572,48993,52826.413240000002,null,null,null,-7703,779,37,-5620,275,21,-4136.1754900000005,74.45,68.966859999999997,8070,0,4000,0,4000,2000,27858,19714,8144,543,27715,19420,8295,536,29419.923999999999,18975.492999999999,10444.431,611.80408,5270.5500941225682,5437.3075698057119,5408.7949210611105,1205.2622896551725,129.44498868598137,null,null,null,null,null,3040,-3040]
[9,"Alavieska",2519,null,1.1490431084477093,56.665442526625043,-3183.0091306073837,null,null,null,43.548975655528331,720.12703453751487,34.645492124954217,7586.7407701468837,4470,2190,17586,-15396,7962,8909,null,null,-26,11,1460,745,0,0,715,0,0,0,715,823,1460,null,-313,-344,324,7962,6931,263,768,22,null,17,2517,null,0.49544072948328266,56.152367811560637,-2744.1398490266188,null,null,null,45.631758679567447,1490.2661899086213,56.911294010059443,9557.8069129916566,4572,2476,18348,-15872,7716,10101,null,null,15,11,1971,705,0,0,1266,0,0,0,1267,2090,1843,null,233,-3963,1594,7716,6711,305,700,22,null,96.330882352941202,2491,null,51.5204350698857,62.723571906253923,-2853.2203492573267,null,null,null,44.615698016608356,1960.3987956643919,88.448234567896705,8089.992569249297,4837.7588699999997,2469.5136499999999,19037.677879999999,-16568.164229999998,8352.9908599999999,9572.6479999999992,null,null,126.93082000000001,6.5788900000000012,1490.9843400000018,738.17448000000002,0,0,752.80986000000178,0,0,0,752.80985999999996,2843.1363199999996,1498.8438999999998,null,-65.291660000000007,0,403.4846,8352.9908599999999,7136.8307199999999,469.54071999999996,746.61941999999999,22,null,165,11440,12132,12412.43849,null,null,null,-1151,0,15,-1061,11,801,-1312.0875900000001,4.7237900000000002,212.00450000000001,0,1000,0,4500,0,1321.1592900000001,9463,833,8630,84,10000,0,10000,774,11000,0,11000,1410,4017.4672489082964,4469.209376241557,5148.8936611802483,324.40139636363637,130.22938432903908,null,null,null,null,null,792,-792]
[10,"Alavus",11468,null,0.2171916408731363,63.285908259047169,-2337.2863620509243,null,null,null,50.387057174528429,1263.1670735960934,54.930497839095743,8393.442622950819,24125,11960,84410,-72208,34663,38072,null,null,-71,620,1076,3653,9142,0,6565,0,0,0,6565,21344,886,null,-9544,-3177,1926,34663,29279,2585,2799,21.25,null,183,11332,null,1.2806647940074907,63.145369428957686,-2458.6127779738795,null,null,null,49.576604180095543,2285.9159901164844,98.138525891865527,8501.8531591951996,23589,11612,85363,-73751,35072,43125,null,null,-106,837,5177,4032,0,0,1145,0,0,0,1145,22489,5031,null,9535,-3978,-1397,35072,29760,2810,2502,21.25,null,240.38235294117601,11197,null,0.83566273184302953,68.885717962156818,-2815.5570768955968,null,null,null,45.004122934177644,2521.9884585156742,101.51035752987197,9068.2942091631685,24808.294859999998,13815.95536,90507.812709999998,-76691.857349999991,36841.078780000003,42180.877,null,null,-71.812930000000023,1182.2317800000001,3440.5172800000073,4321.4855399999997,0,0,-880.96825999999282,0,0,0,-880.96825999999999,19022.54681,3297.75234,null,-1152.77548,4165.0276400000002,-1391.2062800000001,36841.078780000003,30170.763579999999,3934.9839200000001,2735.3312799999999,21.25,null,45,53095,54746,57796.276899999997,null,null,null,-8782,156,9666,-6980,262,290,-5949.2176399999998,402.39802000000003,857.86099999999999,8000,2000,7400,-3000,9000,2000,45243,38265,6978,7374,45665,41500,4165,7195,52499.695,45743.387000000002,6756.308,6763.1732099999999,6850.4534356470176,7135.7218496293681,7803.4950727873538,1419.8006390588234,126.80187899069603,null,null,null,null,null,2706,-2706]
[16,"Asikkala",8083,null,2.1669106881405562,21.974680745204267,-1233.9477916615119,null,null,null,75.357891584306685,123.22157614746999,6.7047822799284411,6708.0291970802919,13729,6112,52010,-45898,29745,18410,null,null,-40,147,2364,2215,0,182,-33,94,0,0,61,11007,2079,null,396,-15,145,29745,25296,1538,2911,20.75,null,90,8059,null,160.92592592592592,10.143804937190584,-381.06464821938204,null,null,null,87.028956763189214,110.80779253009058,6.1119653471844586,6617.3222484179178,13872,5611,50709,-45098,31883,21892,null,null,-44,13,8646,2509,0,0,6137,94,-5000,0,1231,12238,8594,null,-1107,-10,6563,31883,27480,1731,2672,20.75,null,21.786764705882401,8033,null,158.49364968902617,11.330913450331995,21.160003734594863,null,null,null,86.555134386353174,375.64488733972365,18.849451917774029,7273.9719158471316,15001.369500000001,6449.0445199999995,53598.337700000004,-47149.293180000008,32598.166870000001,20316.576000000001,null,null,-37.030470000000001,103.64464999999998,5832.0638699999936,2388.0197000000003,0,0,3444.0441699999933,-94.281679999999994,3000,0,538.32584999999995,13033.76952,5832.06387,null,-1561.22552,0,2724.3410099999996,32598.166870000001,27175.237679999998,2474.8977200000004,2948.0314700000004,20.75,null,214,34689,33295,34503.988239999999,null,null,null,-2006,0,72,-2276,19,226,-4674.5150199999998,0,1566.79216,0,-3000,0,-5500,0,-509.9,7455,1445,6010,810,1945,1435,510,791,1434.9,1425,9.9,747.37869999999998,2404.6764815043916,1623.5264921206106,1721.7580356031372,1309.6500086746987,163.03373691954422,null,null,null,null,null,380,-380]
[18,"Askola",4943,null,0.73018462222881297,84.090208885328735,-3763.3016386809632,null,null,null,27.030898301616535,1226.1784341493021,61.518450543644505,7275.1365567469147,13781,4448,30316,-25868,19707,8303,null,null,-231,319,2230,1274,2496,0,3452,0,0,0,3452,2648,4638,null,-1278,-1238,1046,19707,17550,957,1200,21.5,null,43,4878,null,2.606299212598425,81.299611796743733,-3670.5617056170563,null,null,null,33.043519687477669,1757.8925789257892,87.3291015625,7347.273472734727,13415,4111,30586,-26475,20456,9951,null,null,-173,366,4125,2141,0,0,1984,0,0,0,1983,4631,4098,null,1047,-1473,694,20456,18369,1008,1079,21.5,null,72.154411764705898,4847,null,1.8581318771633317,78.403454193782252,-3298.3453331957917,null,null,null,35.961510920080748,1882.4753455745822,95.026572517496547,7230.6459438828142,13824.906919999999,5182.86463,32168.371190000002,-26985.506560000002,21255.042739999997,8349.6579999999994,null,null,-150.72920000000002,514.34118000000001,2982.806159999996,1512.6518999999998,0,0,1470.1542599999962,0,0,0,1470.15426,6101.4307500000004,2785.72516,null,-578.73562000000004,1524.366,1923.49315,21255.042739999997,18635.854800000001,1445.0220200000001,1174.1659199999999,21.5,null,169,12858,13433,14721.042579999999,680,null,null,-4153,308,253,-3582,114,64,-1205.1260199999999,0,342.89401000000004,5000,-2000,0,3500,0,0,22972,18999,3973,0,24997,17473,7524,0,23473.241090000003,16001.553330000001,7471.6877599999998,0,6031.7620878009302,6696.3919639196392,6394.3889106663919,866.7839441860466,178.8289548557967,null,null,null,null,null,699,-699]
[19,"Aura",3941,null,0.35407786302926969,64.10344237026888,-3314.6409540725704,null,null,null,24.504793887185478,248.92159350418675,14.539529784382994,6248.9215935041866,6514,2647,22749,-20102,14707,6002,null,null,-13,16,610,847,0,0,-237,28,0,0,-209,-30,747,null,44,-714,-317,14707,13353,603,751,21.75,null,153,3959,null,2.5459677419354838,55.662202663226978,-2722.9098257135638,null,null,null,32.438339057133938,799.94948219247283,45.569243505341582,6407.4261177064918,6688,2657,23226,-20569,15595,8107,null,null,-26,24,3131,893,0,0,2238,28,0,0,2266,2236,2883,null,203,-1214,2177,15595,14340,541,714,21.5,null,91.294117647058897,3955,null,2.5633733518884072,44.862438584529912,-2284.4447281921616,null,null,null,41.816267693689753,464.88789127686476,25.84503968949398,6565.4408874841965,7208.8252599999996,3069.4745600000001,24059.145710000001,-20989.671150000002,15987.4943,7510.7550000000001,null,null,-18.509580000000003,41.218499999999999,2531.2870699999985,885.66905000000008,0,0,1645.6180199999983,-27.787680000000002,0,0,1673.4057,3908.5385199999996,2453.3862000000004,null,-320.33348000000001,976.19399999999996,1729.73783,15987.4943,14407.52326,740.52879000000007,839.44224999999994,21.5,null,186,12935,13287,14396.97301,null,540,null,-1132,22,46,-888,1,181,-935.00202000000002,73.466999999999999,137.88665,5000,-2700,0,500,0,-2000,13047,5333,7714,0,12333,4357,7976,0,9357.1540000000005,3619.06,5738.0940000000001,0,3948.2364882009642,3688.3051275574639,2852.4036055625788,670.11736093023251,169.43548948931289,null,null,null,null,null,607,-607]
[46,"Enonkoski",1361,null,7.6088474970896387,10.682596854959149,1544.4526083761939,null,null,null,89.985320502365028,2108.0088170462896,93.265496971856081,8249.8163115356347,2446,1423,10689,-9244,4713,5247,null,null,12,89,817,655,0,0,162,0,0,0,162,6025,817,null,54,0,267,4713,3580,597,536,21,null,15,1369,null,{"$error":"#DIV/0!"},11.057046979865772,2508.4002921840761,null,null,null,88.432256633897552,3284.8794740686631,151.81326304106548,7897.7355734112489,2445,1564,10567,-9003,4642,5745,null,null,8,110,1502,573,0,0,929,0,0,0,929,6955,1433,null,-279,0,1288,4642,3472,680,490,21,null,17.757352941176499,1362,null,8651.6793218720159,10.651739356883279,3637.9284214390609,null,null,null,82.994575624188116,4158.7211747430247,186.03392742236952,8159.443010279002,2609.9777000000004,1859.1443800000002,10779.093570000001,-8919.9491899999994,5024.6173499999995,5572.0309999999999,null,null,13.588100000000001,121.16499,1811.4522500000003,568.68366000000003,0,0,1242.7685900000004,0,0,0,1242.7685900000001,8197.9461899999988,1793.6407300000001,null,-360.47709999999995,0,1501.6923999999999,5024.6173499999995,3512.82071,973.22829999999999,538.56833999999992,21,null,286,7318,7242,7167.4550099999997,null,null,null,-558,0,8,-275,0,130,-323.06711000000001,0,31.118779999999997,0,0,0,0,0,0,0,0,0,261,0,0,0,236,0,0,0,197.91123000000002,590.74210139603235,824.68955441928415,1072.0408296622613,167.27717666666666,122.8173103279491,null,null,null,null,null,63,-63]
{"$rows_left_out":286}