{"text_format":"1","workbook":"xlsx","n_sheets":2,"sheets":["Kuntakortti","Luvut"],"not_rendered":{"charts":0,"images":0,"macros":1,"external_links":0,"defined_names":2,"comments":0,"pivot_tables":0},"unopened":[],"bounds":{"document_bytes":16777216,"sheet_cells":100000,"rows_first":2000,"rows_last":500,"rows_between":2000,"halvings":0,"cell_chars":16384,"cell_head_chars":4096},"cells_cut":0,"cells_raw":0,"read":"whole","date_system":"1900"}

{"sheet":"Kuntakortti","index":0,"n_rows":79,"n_cols":15,"rows_kept":79,"cut":false,"hidden":false,"merged":[[1,6,1,7]]}
["Valtiovarainministeriö/Kunta- ja aluehallinto-osasto,4.6.2019"]
["KUNTAKONSERNIEN TP 2016 - 2018 (lyhennetty kaava)",null,null,null,null,null,"Valitse kunta valikosta:"]
[null,null,null,null,null,null,null," "]
[{"$f":"INDEX(Luvut!$B$3:'Luvut'!$B$298,$A$7)","v":"KOKO MAA (Manner-Suomi)"},null,null,2016,null,null,2017,null,null,2018]
[]
["Asukasluku",null,null,{"$f":"VLOOKUP($A$4,Luvut!$B$3:$AV$298,2)","v":5474085},null,null,{"$f":"VLOOKUP($A$4,Luvut!$B$3:$EJ$298,48)","v":5483641}," ",{"$f":"((G6/D6)-1)*100","v":0.1745679871613337},{"$f":"VLOOKUP($A$4,Luvut!$B$3:$EJ$298,94)","v":5488130}," ",{"$f":"((J6/G6)-1)*100","v":8.1861668187244163E-2}]
[96,null,null," "]
["Tunnuslukuja",null,null," "]
[null,null,null," "," "," "," ",null,"muut.%"," ",null,"muut.%"]
["Lainat, euro/as",null,null,{"$f":"E67","v":6160.4067163736036}," ",null,{"$f":"H67","v":6314.2279007688503},null,{"$f":"((G10/D10)-1)*100","v":2.4969322883570122},{"$f":"K67","v":6557.6436782656383},null,{"$f":"((J10/G10)-1)*100","v":3.8550362977419317}]
[]
["Lainanhoitokate*",null,null,{"$f":"VLOOKUP($A$4,Luvut!$B$3:$AV$298,4)","v":1.6}," ",null,{"$f":"VLOOKUP($A$4,Luvut!$B$3:$EJ$298,50)","v":1.8853791839128096},null,null,{"$f":"VLOOKUP($A$4,Luvut!$B$3:$EJ$298,96)","v":1.5263679823177443}]
["Suhteellinen velkaantuneisuus, %",null,null,{"$f":"VLOOKUP($A$4,Luvut!$B$3:$AV$298,5)","v":77.599999999999994}," ",null,{"$f":"VLOOKUP($A$4,Luvut!$B$3:$EJ$298,51)","v":78.715524364417803},null,null,{"$f":"VLOOKUP($A$4,Luvut!$B$3:$EJ$298,97)","v":80.756103243819908}]
["Rahoitusvarallisuus, euro/as",null,null,{"$f":"VLOOKUP($A$4,Luvut!$B$3:$AV$298,6)","v":-5949}," ",null,{"$f":"VLOOKUP($A$4,Luvut!$B$3:$EJ$298,52)","v":-6016.3015777291039},null,null,{"$f":"VLOOKUP($A$4,Luvut!$B$3:$EJ$298,98)","v":-6400.7277524402662}]
["Omavaraisuusaste, %",null,null,{"$f":"VLOOKUP($A$4,Luvut!$B$3:$AV$298,10)","v":42.9},null,null,{"$f":"VLOOKUP($A$4,Luvut!$B$3:$EJ$298,56)","v":43.38546407547495},null,null,{"$f":"VLOOKUP($A$4,Luvut!$B$3:$EJ$298,102)","v":42.443907732165421}]
{"$rows_left_out":65}
{"sheet":"Luvut","index":1,"n_rows":298,"n_cols":174,"rows_kept":298,"cut":false,"hidden":false,"merged":[]}
[null,null,2016,"hakee muualta",92,93,94,"vanha",96,97,98,99,100,101,102,103,104,null,105,106,107,108,"summana",110,111,112,113,114,115,116,null,117,118,119,120,121,122,"kaavasta",124,125,126,127,128,129,130,131,"kaavasta",133,2017,"hakee muualta",92,93,94,"vanha",96,97,98,99,100,101,102,103,104,null,105,106,107,108,"summana",110,111,112,113,114,115,116,117,null,118,119,120,121,122,"kaavasta",124,125,126,127,128,129,130,131,"kaavasta",133,2018,"hakee muualta",92,93,94,"vanha",96,97,98,99,100,101,102,107,108,109,110,111,112,113,"summana",115,116,117,118,119,120,121,122,123,124,125,126,127,128,"kaavasta",130,131,132,133,134,135,136,137,"kaavasta",139,"Erillistiedot",141,142,143,144,145,2016,147,148,2017,150,151,2018,153,154,2016,156,2017,158,2018,160,2016,162,163,164,2017,166,167,168,2018,170,171,172,2017]
["Kunta nro","Kunta","Asukasluku ","Lainat e/asukas","Lainanhoitokate","Suhteellinen velkaantuneisuus-%","Rahoitusvarallisuus, e/as","Vuosikate","Suunnitelman mukaiset poistot","Tilikauden tulos","Omavaraisuusaste, %","Rahavarat e/as","Kassan riittävyys, pv","Kassasta maksut, €/as","Henkilöstökulut","Toimintatuotot","Toimintakulut","Osuus osakkuusyhteisojen voitosta/tappiosta","Toimintakate","Verotulot","Valtionosuudet","Alv-takaisinperintä","Käyttökate","Korkotuotot/-menot, netto","Muut rahoitustuotot/-menot, netto (sis Osinkotuotot)","Vuosikate","Suunnitelman mukaiset poistot ja arvonalet","Satu. erät, netto","Satunnaiset kulut","Tilikauden tulos","Vähemmistöosuudet","Tilinpäätössiirrot","Tilikauden verot","Lask. Verot","Tilikauden yli- tai alijäämä","Kumulat yli/alij","Tulorah (toiminnan rahavirta)","Investoinnit, netto","Saamisten muutos (ent Pitkäaikaisten saamisten muutokset, netto)","Pitkäaikaisten lainojen vähennys","Toim ja inv rahavirta","Verotulot","Kunnallisvero","Osuus yhteisöveron tuotosta","Kiinteistövero","Tuloveroprosentti 2015","Yhden veroprosentin tuotto 2015","Sijoitus vuosikatteen mukaan","Asukasluku ","Lainat e/asukas","Lainanhoitokate","Suhteellinen velkaantuneisuus-%","Rahoitusvarallisuus, e/as","Vuosikate","Suunnitelman mukaiset poistot","Tilikauden tulos","Omavaraisuusaste, %","Rahavarat e/as","Kassan riittävyys, pv","Kassasta maksut, €/as","Henkilöstökulut","Toimintatuotot","Toimintakulut","Osuus osakkuusyhteisojen voitosta/tappiosta","Toimintakate","Verotulot","Valtionosuudet","Alv-takaisinperintä","Käyttökate","Korkotuotot/-menot, netto","Muut rahoitustuotot/-menot, netto (sis Osinkotuotot)","Vuosikate","Suunnitelman mukaiset poistot ja arvonalet","Satu. erät",null,"Tilikauden tulos","Vähemmistöosuudet","Tilinpäätössiirrot","Tilikauden verot","Lask. verot","Tilikauden yli- tai alijäämä","Kumulat yli/alij","Toiminnan rahavirta","Investoinnit, netto","Saamisten muutos ","Pitkäaikaisten lainojen vähennys","Toim ja inv rahavirta","Verotulot","Kunnallisvero","Osuus yhteisöveron tuotosta","Kiinteistövero","Tuloveroprosentti 2016","Yhden veroprosentin tuotto 2016","Sijoitus vuosikatteen mukaan","Asukasluku","Lainat e/asukas","Lainanhoitokate","Suhteellinen velkaantuneisuus-%","Rahoitusvarallisuus, e/as","Vuosikate","Suunnitelman mukaiset poistot","Tilikauden tulos","Omavaraisuusaste, %","Rahavarat e/as","Kassan riittävyys, pv","Kassasta maksut, €/as","Henkilöstökulut","Toimintatuotot","Toimintakulut","Osuus osakkuusyhteisojen voitosta/tappiosta","Toimintakate","Verotulot","Valtionosuudet","Alv-takaisinperintä","Käyttökate","Korkotuotot/-menot, netto","Muut rahoitustuotot/-menot, netto (sis Osinkotuotot)","Vuosikate","Suunnitelman mukaiset poistot ja arvonalet","Satu. erät","Satu. kulut","Tilikauden tulos","Vähemmistöosuudet","Tilinpäätössiirrot","Tilikauden verot","Lask. verot","Tilikauden yli- tai alijäämä","Kumulat yli/alij","Toiminnan rahavirta","Investoinnit, netto","Saamisten muutos ","Pitkäaikaisten lainojen vähennys","Toim ja inv rahavirta","Verotulot","Takaukset muiden puolesta (jäljellä oleva pääoma)","Osuus yhteisöveron tuotosta","Kiinteistövero","Tuloveroprosentti 2017","Yhden veroprosentin tuotto 2006","Sijoitus vuosikatteen mukaan","Palvelujen ostot 2015","Palvelujen ostot 2016","Palvelujen ostot 2017","Harkvar2015","Harkvar2016","Harkvar2017"," - Investointimenot"," + Rahoitusos. investointimenoihin"," + Investointihyödykk. luovutustulot"," - Investointimenot"," + Rahoitusosuudet investointimenoihin"," + Investointihyödykkeiden luovutustulot"," - Investointimenot"," + Rahoitusosuudet investointimenoihin"," + Investointihyödykkeiden luovutustulot","Pitkäaikaisten lainojen lisäys"," ± Lyhytaikaisten lainojen muutos","Pitkäaikaisten lainojen lisäys"," ± Lyhytaikaisten lainojen muutos","Pitkäaikaisten lainojen lisäys"," ± Lyhytaikaisten lainojen muutos","Lainakanta","josta pitkäaik","josta lyhytaik","Lainasaamiset","Lainakanta","josta pitkäaik","josta lyhytaik","Lainasaamiset","Lainakanta","josta pitkäaik","josta lyhytaik","Lainasaamiset","Takaukset muiden puolesta (jäljellä oleva pääoma)"]
[20,"Akaa",16923,null,1.0921571119867801,60.475798756210722,-4432.7246942031561,0,0,0,21.108851724281031,563.37528806949126,21.969544877743896,9359.8652721148737,null,57740,143891,22,-86129,60148,34067,null,null,-317,132,7901,7116,98,0,883,-84,9,-73,-46,689,-7699,7815,null,1105,-7176,2261,null,null,null,null,21.25,null,243,16769,null,1.1838147211500067,58.257712048256522,-4381.4777267577074,null,null,null,22.404665080948362,382.84930526566882,16.356744984713323,8543.2643568489475,null,58889,142923,96,-83938,59399,32904,null,null,-261,144,8248,7001,0,null,1247,-71,1,-84,-57,1036,-6683,7470,null,-839,-6867,1442,null,null,null,null,21.25,null,255,16611,null,0.69020213363279059,61.743501812088383,-4767.322858346879,null,null,null,18.920032976092333,387.03268918186745,14.023695691149227,10073.44530732647,null,61885,150217,9,-88323,59625,32456,null,null,-67,764,4455,7026,0,null,-2571,-87,2,-94,-35,-2785,-9836,4350,null,-1160,-6662,-4561,null,6892,null,null,21.75,null,233,null,null,null,null,null,null,-6421,394,473,-7344,97,1219,-9405,130,364,8646,-1099,1321,983,12126,-139,70428,54402,16026,7390,65864,49356,16508,7271,71190,54540,16650,7687,5140]
[5,"Alajärvi",9899,null,2.0293874855539045,41.824732200982425,-3915.5470249520154,null,null,null,34.875874753762936,926.35619759571671,23.770142533502831,14224.568138195778,null,66345,123039,77,-56617,29436,39395,null,null,-477,57,11794,4798,0,0,6996,-65,83,-68,-9,6937,5760,11859,null,-2632,-5559,2530,null,null,null,null,22,null,23,9831,null,1.7521731089328647,48.649492071052563,-4045.0615400264473,null,null,null,35.970768399702386,959.10894110466893,32.137614507559135,10892.991557318686,null,54164,112513,114,-58235,29659,37946,null,null,-346,83,9107,5188,0,null,3919,-102,9,-87,-16,3723,9052,8653,null,-1173,-5040,-817,null,null,null,null,21.75,null,89,9700,null,0.93271164746754431,52.878660950409831,-4758.0412371134025,null,null,null,33.057348584433676,914.63917525773195,24.198955305300444,13795.773195876289,null,56110,116873,190,-60573,28893,36755,null,null,-343,4,4736,5876,0,null,-1140,-5,25,-50,0,-1170,7456,4436,null,892,-5104,-6142,null,808,null,null,21.75,null,148,null,null,null,null,null,null,-11502,134,2039,-10966,647,849,-11309,579,152,4181,-1500,6607,1439,7075,2000,38620,32085,6535,28,41635,33495,8140,17,45721,35494,10227,115,1006]
[9,"Alavieska",2639,null,2.0673076923076925,41.583249422496003,-3485.03220917014,null,null,null,36.636808895556634,749.52633573323226,21.422170791050977,12770.746494884426,null,16234,32053,0,-15819,7683,9849,null,null,-50,6,1669,1054,681,0,1296,-1,0,1,-1,1295,329,2383,null,-1245,-781,1858,null,null,null,null,21.5,null,171,2610,null,1.5446559297218154,42.485539998103604,-3465.9003831417622,null,null,null,37.483545912577732,864.75095785440612,27.283731867258396,11568.582375478927,null,14579,30594,1,-16014,7282,9778,null,null,-45,9,1010,1059,0,null,-49,0,0,-1,-1,-51,300,1037,null,727,-638,142,null,null,null,null,21.5,null,276,2573,null,2.1007407407407408,40.653167057661442,-3263.8942868247182,null,null,null,38.78576602680188,1184.6094053633892,33.898656266187274,12755.149630781189,null,15045,30994,1,-15948,7525,9826,null,null,-29,15,1389,979,72,null,482,-1,-1,-1,1,480,926,1456,null,415,-646,554,null,1543,null,null,21.5,null,127,null,null,null,null,null,null,-815,9,281,-1100,201,4,-1137,234,1,93,-3,118,-2000,95,1499,10838,5187,5651,110,8306,4767,3539,102,9237,4309,4928,94,1172]
[10,"Alavus",11907,null,0.77409484956654773,60.311737578640255,-5001.1757789535568,null,null,null,35.397847832676568,1332.9134122784915,37.171718792109957,13088.267405727724,null,64883,130531,541,-65107,34376,38870,null,null,-449,949,8639,6022,0,0,2617,-34,-12,-6,-50,2515,12545,7964,null,489,-11297,-2302,null,null,null,null,21.25,null,133,11713,null,1.447011952191235,58.449251892759762,-5011.6964057030646,null,null,null,38.531823506442798,1515.4102279518484,47.793900675735493,11573.123879450182,null,70759,136082,1545,-63778,35110,38629,null,null,-579,873,10255,6434,0,null,3821,-31,-4,-18,-30,3738,20120,8996,null,1315,-6889,1581,null,null,null,null,21.25,null,101,11544,null,0.3384476903563684,59.982757781593932,-5336.5384615384619,null,null,null,38.205106750895979,1512.6472626472628,37.079702135086393,14889.98613998614,null,71741,137803,1547,-64515,33798,38294,null,null,-519,610,7668,6649,0,null,1019,-4,9,-17,-68,939,20657,6355,null,1916,-23837,-2613,null,1995,null,null,21.25,null,86,null,null,null,null,null,null,-12793,546,1981,-9360,768,1177,-9478,139,371,19669,554,8780,-1568,25419,-996,69825,59081,10744,2204,70327,61433,8894,2876,71092,64304,6788,2698,1190]
[16,"Asikkala",8323,null,2.090716180371353,46.726549919484704,-3451.3997356722339,null,null,null,43.606870229007633,377.38796107172897,14.377178901958816,9580.9203412231163,null,31656,71447,4,-39787,29926,17906,null,null,-176,-171,7698,4014,-6,0,3678,0,-1,0,-81,3596,7509,7667,null,-1007,-3586,4275,null,null,null,null,20.75,null,70,8248,null,8.8795944233206594,39.584655642781584,-3093.3559650824441,null,null,null,46.135141109719257,557.8322017458778,20.979212732201528,9705.2618816682825,null,42592,82843,-3,-40254,29700,17513,null,null,-120,43,6882,4354,64,null,2592,0,0,-2,-43,2547,9751,6503,null,-158,-665,3943,null,null,null,null,20.75,null,115,8149,null,6.1349999999999998,38.468645982923107,-2786.845011657872,null,null,null,47.373709017301756,941.58792489876055,31.678637679847974,10848.938520063812,null,43453,84756,-6,-41309,28838,17538,null,null,-109,-163,4795,4165,263,null,893,0,0,-13,-59,821,10527,4897,null,1261,-687,2672,null,12,null,null,20.75,null,118,null,null,null,null,null,null,-4015,231,392,-3984,196,1228,-2610,106,279,2274,-2000,326,-3250,82,-1150,28449,9771,18678,229,24863,9426,15437,388,23108,8822,14286,344,12]
[18,"Askola",5046,null,1.4014900662251655,64.733287320055211,-4507.5307173999208,null,null,null,18.513468316653373,340.86405073325403,14.628917627869042,8504.7562425683718,null,14258,39091,0,-24833,19174,7136,null,null,-192,216,1501,1892,0,0,-391,0,93,0,0,-298,-2045,1323,null,-419,-1016,-961,null,null,null,null,20.25,null,275,4990,null,1.4330708661417322,71.397621684078757,-5016.0320641282569,null,null,null,16.120002870882079,511.0220440881763,25.017471239651648,7455.7114228456921,null,15461,39934,-30,-24503,18756,7325,null,null,-172,242,1648,2120,0,null,-472,0,123,-3,0,-352,-2503,1460,null,-373,-1098,-2271,null,null,null,null,20.75,null,282,4958,null,0.55878712871287128,80.769047278278705,-5369.9072206534893,null,null,null,16.294861424496574,1060.9116579265833,40.30355193551096,9607.9064138765625,null,14418,41260,-2,-26844,18547,8957,null,null,-216,243,687,2089,2228,null,826,0,178,-6,0,998,-1633,2718,null,201,-1400,-1523,null,2000,null,null,20.75,null,265,null,null,null,null,null,null,-2567,2,281,-4053,12,310,-4701,21,439,2695,-1485,2257,1738,7045,-1916,21697,15999,5698,0,24594,16477,8117,0,28168,21682,6486,0,2000]
[19,"Aura",3984,null,2.2751054852320673,59.635085167000064,-4296.4357429718875,null,null,null,17.962466487935657,299.69879518072293,13.426890134943619,8147.0883534136537,null,12522,30312,0,-17790,14440,6032,null,null,-66,12,2628,1259,0,0,1369,-49,0,0,0,1320,-543,2607,null,156,-1117,1700,null,null,null,null,21.75,null,159,3991,null,2.9554247266610596,55.610570900196862,-3685.0413430217991,null,null,null,25.320338588180476,588.32372838887488,28.450685522690303,7547.7323978952645,null,12669,30038,1,-17368,14873,5984,null,null,-62,22,3449,1306,0,null,2143,-24,0,0,0,2119,1556,3453,null,-224,-1124,2452,null,null,null,null,21.75,null,103,3984,null,1.2023622047244094,56.550585501574588,-3912.9016064257025,null,null,null,25.069680424573328,261.29518072289153,10.90787736119883,8743.4738955823304,null,12003,31204,1,-19200,14314,6390,null,null,-52,23,1475,1297,0,null,178,-41,-81,0,-21,35,1642,1562,null,-278,-1218,-850,null,1020,null,null,21.75,null,189,null,null,null,null,null,null,-958,3,48,-1111,10,100,-2336,16,-92,49,-520,197,-593,225,464,16296,5511,10785,0,14775,4567,10208,0,14251,3750,10501,0,912]
[46,"Enonkoski",1453,null,4.4672897196261685,17.256129368805425,807.29525120440474,null,null,null,77.051005041576644,2294.5629731589815,63.816141381299495,13123.88162422574,null,9399,17959,0,-8560,4544,5227,null,null,-13,212,1410,780,-65,0,565,0,-79,0,9,495,6061,1452,null,-54,-297,806,null,null,null,null,21,null,58,1416,null,9.0487804878048781,17.954251186879585,960.45197740112997,null,null,null,75.029689355584722,2175.8474576271187,60.895922456273354,13041.666666666666,null,10316,19838,0,-9522,4854,5683,null,null,-4,71,1082,787,-16,null,279,0,0,0,-36,243,6840,1036,null,-876,-92,-56,null,null,null,null,21,null,151,1405,null,7.7179487179487181,18.698988319241483,748.75444839857653,null,null,null,74.059745037102815,2365.8362989323846,57.851420942208662,14926.690391459075,null,10151,19928,0,-9777,4481,5829,null,null,-7,62,588,843,5,null,-250,0,1,-1,-8,-258,6659,577,null,469,-64,-225,null,108,null,null,21,null,174,null,null,null,null,null,null,-787,73,68,-1552,18,442,-907,94,11,44,-82,14,0,9,52,1164,1022,142,-53,1085,930,155,0,1082,787,295,0,109]
[47,"Enontekiö",1872,null,1.1660405709992487,99.922317167905888,-7270.2991452991455,null,null,null,31.974544811737669,1537.9273504273506,48.254350920696155,11633.01282051282,null,2936,16836,-4,-13904,6151,8935,null,null,-82,266,1366,1108,0,0,258,-1,0,0,2,259,576,1306,null,540,-1145,-924,null,null,null,null,21.25,null,131,1893,null,1.8922413793103448,81.736962393517558,-6499.7358689910197,null,null,null,36.441123460498645,1033.2805071315372,44.947116595316047,8390.9138932910719,null,4225,17496,2,-13269,6203,8824,null,null,-157,421,2022,1177,-22,null,823,0,-11,0,-3,809,1400,1995,null,996,-987,1231,null,null,null,null,21.25,null,59,1852,null,1.4804177545691906,65.110792821636196,-6109.6112311015122,null,null,null,38.778688220681474,1225.7019438444925,33.211079044412379,13470.842332613391,null,8772,22485,-11,-13724,6362,8604,null,null,-121,443,1564,1111,0,null,453,0,10,-23,-1,439,1933,1596,null,723,-1012,852,null,1161,null,null,21.25,null,41,null,null,null,null,null,null,-3331,1021,80,-2967,2153,50,-1018,87,187,307,456,0,-342,0,48,11675,9704,1971,81,10397,8767,1630,116,9399,7721,1678,136,5138]
[49,"Espoo",274583,null,1.9425422165541271,140.2772277383321,-8531.3329667168036,null,null,null,41.82287592228009,3764.1733100738206,120.0713733051426,11442.554710233337,null,982749,2234818,-2334,-1254403,1446483,116040,null,null,-30747,20127,297500,237379,13541,0,73662,29,60,-1649,10,72112,629653,259201,null,-12525,-131950,-372917,null,null,null,null,18,null,37,279044,null,1.9841792278827195,147.25046516140154,-9164.6765384670525,null,null,null,40.764271864450905,3871.3822909648657,214.29947461071356,6593.8310804030898,null,1012445,2264850,994,-1251411,1490270,84559,null,null,-43228,39111,319301,267979,1200,null,52522,-463,17,-390,-773,50913,600201,289704,null,22161,-133610,-231776,null,null,null,null,18,null,44,283632,null,1.7712961263080595,143.48878060487368,-9498.6849156653698,null,null,null,40.414220850683257,3541.0320415185874,118.50017277812024,10906.960427596323,null,1102801,2383893,-1616,-1282708,1501986,95314,null,null,-35590,20923,299925,306013,0,null,-6088,3973,12237,-622,2802,12302,604643,229225,null,-1956,-148680,-151086,null,92306,null,null,18,null,19,null,null,null,null,null,null,-726495,30414,63963,-616503,48410,46613,-495489,36891,78287,626942,-6325,374787,1824,219699,1933,3186678,3056512,130166,210467,3429679,3275274,154405,208539,3502631,3329807,172824,208048,50979]
[50,"Eura",12004,null,1.4813710879284649,67.054980741635831,-4887.9540153282242,null,null,null,33.723507537872543,497.41752749083639,19.564395809581946,9279.9900033322228,null,35238,100185,0,-64947,43653,27037,null,null,-703,1208,6248,5435,0,0,813,-43,0,-1,-127,642,4004,6368,null,880,-3987,-59,null,null,null,null,20.5,null,222,11910,null,1.8194477224451262,65.168098251254776,-4830.3106633081443,null,null,null,35.010461111161867,448.95046179680941,20.097363814231286,8153.6523929471032,null,36426,99266,0,-62840,44397,26168,null,null,-466,-3,7256,5748,0,null,1508,30,0,0,-4,1534,5504,6875,null,-463,-3784,1115,null,null,null,null,20.5,null,219,11748,null,0.47165354330708659,70.15753209251794,-5271.7909431392573,null,null,null,31.1763410067188,486.38066053796393,18.378980947848923,9659.346271705821,null,36008,103147,0,-67139,43565,25358,null,null,-377,9,1416,5804,0,null,-4388,36,0,0,38,-4314,1114,1138,null,877,-3429,-4519,null,607,null,null,20.5,null,272,null,null,null,null,null,null,-6501,87,-13,-6603,191,652,-6341,81,603,271,4200,334,1632,933,4000,54035,38127,15908,50,52506,35316,17190,50,54266,33394,20872,50,552]
[51,"Eurajoki",6070,null,9.1562189054726364,22.306942104796523,2182.537067545305,null,null,null,84.828522920203739,4058.1548599670514,130.27290377733021,11370.181219110378,null,21029,59307,-6,-38284,38036,8609,null,null,71,731,9163,4275,3,0,4891,2,0,-1,-6,4886,73485,9091,null,1833,-966,1073,null,null,null,null,18,null,7,9521,null,5.9514884233737595,33.448408530815541,-191.15639113538492,null,null,null,74.539344161437185,2540.8045373385153,108.93889108226817,8512.9713265413302,null,30898,86250,0,-55352,51919,13352,null,null,-92,836,10663,5641,-2,null,5024,0,29,-3,-13,5037,76253,10769,null,-365,-1681,3378,null,null,null,null,18,null,47,9454,null,2.9886304909560724,33.19823769702932,15.337423312883436,null,null,null,75.003105493618207,2765.1787603130947,99.312336722905101,10162.78823778295,null,31437,87039,0,-55602,50340,11737,null,null,-129,-693,5653,5919,0,null,-266,1,-52,0,-7,-324,75926,5702,null,1108,-1805,1863,null,47,null,null,18,null,113,null,null,null,null,null,null,-8307,16,273,-7916,39,486,-5328,16,1473,26,-904,568,-763,660,-379,3694,2948,746,130,17545,15617,1928,130,16111,14279,1832,62,111]
[52,"Evijärvi",2535,null,2.3192019950124689,35.036466273847296,-347.14003944773174,null,null,null,56.236619193893695,2625.2465483234714,96.334523101328585,9946.7455621301779,null,7088,23575,4,-16483,8615,8566,null,null,171,35,904,834,0,0,70,-7,-30,-6,-2,25,3286,924,null,47,-375,-273,null,null,null,null,21.5,null,264,2499,null,2.2268431001890359,38.61535243672872,-228.09123649459784,null,null,null,54.727410511300313,3002.8011204481791,119.83549177458872,9146.058423369348,null,7148,23269,0,-16121,8224,8533,null,null,72,448,1156,888,0,null,268,-7,-28,-8,-2,223,3481,1104,null,-121,-507,339,null,null,null,null,21.5,null,264,2473,null,-0.42926829268292682,42.641199424933248,-877.88111605337645,null,null,null,49.380515197432928,2844.3186413263243,97.553385515616696,10642.135058633239,null,7570,24216,4,-16642,7975,8800,null,null,21,-270,-116,940,0,null,-1056,-2,-25,-2,-1,-1086,2289,-188,null,41,-177,-1554,null,11,null,null,21.5,null,286,null,null,null,null,null,null,-1216,9,10,-976,52,159,-1537,75,96,173,500,618,950,538,550,6210,1705,4505,57,7285,2021,5264,56,8210,2398,5812,54,21]
{"$rows_left_out":283}