{"text_format":"1","workbook":"xlsx","n_sheets":2,"sheets":["Kuntakortti","Luvut"],"not_rendered":{"charts":0,"images":0,"macros":1,"external_links":0,"defined_names":2,"comments":0,"pivot_tables":0},"unopened":[],"bounds":{"document_bytes":16777216,"sheet_cells":100000,"rows_first":2000,"rows_last":500,"rows_between":2000,"halvings":0,"cell_chars":16384,"cell_head_chars":4096},"cells_cut":0,"cells_raw":0,"read":"whole","date_system":"1900"}

{"sheet":"Kuntakortti","index":0,"n_rows":79,"n_cols":15,"rows_kept":79,"cut":false,"hidden":false,"merged":[[1,6,1,7]]}
["Valtiovarainministeriö/Kunta- ja alueosasto, 21.8.2023"]
["KUNTAKONSERNIEN TP 2020 - 2022 (lyhennetty kaava)",null,null,null,null,null,"Valitse kunta valikosta:"]
[null,null,null,null,null,null,null," "]
[{"$f":"INDEX(Luvut!$B$3:'Luvut'!$B$296,$A$7)","v":"Koko Suomi (Manner-Suomi)"},null,null,2020,null,null,2021,null,null,2022]
[]
["Asukasluku",null,null,{"$f":"VLOOKUP($A$4,Luvut!$B$3:$AV$296,2)","v":5503664},null,null,{"$f":"VLOOKUP($A$4,Luvut!$B$3:$EJ$296,48)","v":5517897}," ",{"$f":"((G6/D6)-1)*100","v":0.25860953721013047},{"$f":"VLOOKUP($A$4,Luvut!$B$3:$EJ$296,94)","v":5533611}," ",{"$f":"((J6/G6)-1)*100","v":0.284782408950357}]
[95,null,null," "]
["Tunnuslukuja",null,null," "]
[null,null,null," "," "," "," ",null,"muutos%"," ",null,"muutos%"]
["Lainat, euro/as",null,null,{"$f":"E66","v":7480.4650138525894}," ",null,{"$f":"H66","v":7679.7573193501112},null,{"$f":"((G10/D10)-1)*100","v":2.6641700098652299},{"$f":"K66","v":7867.9616257810676},null,{"$f":"((J10/G10)-1)*100","v":2.4506543449849927}]
{"$rows_left_out":70}
{"sheet":"Luvut","index":1,"n_rows":296,"n_cols":179,"rows_kept":296,"cut":false,"hidden":false,"merged":[]}
[null,null,2020,"hakee muualta",92,93,94,"vanha",96,97,98,99,100,101,102,103,104,null,105,106,107,108,"summana",110,111,112,113,114,115,116,null,117,118,119,120,121,122,"kaavasta",124,125,126,127,128,129,130,131,"kaavasta",133,2021,"hakee muualta",92,93,94,"vanha",96,97,98,99,100,101,102,103,104,null,105,106,107,108,"summana",110,111,112,113,114,115,116,117,null,118,119,120,121,122,"kaavasta",124,125,126,127,128,129,130,131,"kaavasta",133,2022,"hakee muualta",92,93,94,"vanha",96,97,98,99,100,101,102,107,108,109,110,111,112,113,"summana",115,116,117,118,119,120,121,122,123,124,125,126,127,128,"kaavasta",130,131,132,133,134,135,136,137,"kaavasta",139,"Erillistiedot",141,142,143,144,145,2020,147,148,2021,150,151,2022,153,154,2020,156,2021,158,2022,160,2020,162,163,164,2021,166,167,168,2022,170,171,172,2020,2021,2022,2020,2021,2022]
["Kunta nro","Kunta","Asukasluku ","Lainat e/asukas","Lainanhoitokate","Suhteellinen velkaantuneisuus-%","Rahoitusvarallisuus, e/as","Vuosikate","Suunnitelman mukaiset poistot","Tilikauden tulos","Omavaraisuusaste, %","Rahavarat e/as","Kassan riittävyys, pv","Kassasta maksut, €/as","Henkilöstökulut","Toimintatuotot","Toimintakulut","Osuus osakkuusyhteisojen voitosta/tappiosta","Toimintakate","Verotulot","Valtionosuudet","Alv-takaisinperintä","Käyttökate","Korkotuotot/-menot, netto","Muut rahoitustuotot/-menot, netto (sis Osinkotuotot)","Vuosikate","Suunnitelman mukaiset poistot ja arvonalet","Satu. erät, netto","Satunnaiset kulut","Tilikauden tulos","Vähemmistöosuudet","Tilinpäätössiirrot","Tilikauden verot","Lask. Verot","Tilikauden yli- tai alijäämä","Kumulat yli/alij","Tulorah (toiminnan rahavirta)","Investoinnit, netto","Saamisten muutos (ent Pitkäaikaisten saamisten muutokset, netto)","Pitkäaikaisten lainojen vähennys","Toim ja inv rahavirta","Verotulot","Kunnallisvero","Osuus yhteisöveron tuotosta","Kiinteistövero","Tuloveroprosentti 2015","Yhden veroprosentin tuotto 2015","Sijoitus vuosikatteen mukaan","Asukasluku ","Lainat e/asukas","Lainanhoitokate","Suhteellinen velkaantuneisuus-%","Rahoitusvarallisuus, e/as","Vuosikate","Suunnitelman mukaiset poistot","Tilikauden tulos","Omavaraisuusaste, %","Rahavarat e/as","Kassan riittävyys, pv","Kassasta maksut, €/as","Henkilöstökulut","Toimintatuotot","Toimintakulut","Osuus osakkuusyhteisojen voitosta/tappiosta","Toimintakate","Verotulot","Valtionosuudet","Alv-takaisinperintä","Käyttökate","Korkotuotot/-menot, netto","Muut rahoitustuotot/-menot, netto (sis Osinkotuotot)","Vuosikate","Suunnitelman mukaiset poistot ja arvonalet","Satu. erät, netto",null,"Tilikauden tulos","Vähemmistöosuudet","Tilinpäätössiirrot","Tilikauden verot","Lask. verot","Tilikauden yli- tai alij.","Kumulat yli/alij","Toiminnan rahavirta","Investoinnit, netto","Saamisten muutos ","Pitkäaikaisten lainojen vähennys","Toim ja inv rahavirta","Verotulot","Kunnallisvero","Osuus yhteisöveron tuotosta","Kiinteistövero","Tuloveroprosentti 2019","Yhden veroprosentin tuotto 2016","Sijoitus vuosikatteen mukaan","Asukasluku","Lainat e/asukas","Lainanhoitokate","Suhteellinen velkaantuneisuus-%","Rahoitusvarallisuus, e/as","Vuosikate","Suunnitelman mukaiset poistot","Tilikauden tulos","Omavaraisuusaste, %","Rahavarat e/as","Kassan riittävyys, pv","Kassasta maksut, €/as","Henkilöstökulut","Toimintatuotot","Toimintakulut","Osuus osakkuusyhteisojen voitosta/tappiosta","Toimintakate","Verotulot","Valtionosuudet","Alv-takaisinperintä","Käyttökate","Korkotuotot/-menot, netto","Muut rahoitustuotot/-menot, netto (sis Osinkotuotot)","Vuosikate","Suunnitelman mukaiset poistot ja arvonalet","Satu. erät","Satu. kulut","Tilikauden tulos","Vähemmistöosuudet","Tilinpäätössiirrot","Tilikauden verot","Lask. verot","Tilikauden yli- tai alijäämä","Kumulat yli/alij","Toiminnan rahavirta","Investoinnit, netto","Saamisten muutos ","Pitkäaikaisten lainojen vähennys","Toim ja inv rahavirta","Verotulot","Takaukset muiden puolesta (jäljellä oleva pääoma)","Osuus yhteisöveron tuotosta","Kiinteistövero","Tuloveroprosentti 2020","Yhden veroprosentin tuotto 2006","Sijoitus vuosikatteen mukaan","Palvelujen ostot 2018","Palvelujen ostot 2019","Palvelujen ostot 2020","Harkvar2018","Harkvar2019","Harkvar2020"," - Investointimenot"," + Rahoitusos. investointimenoihin"," + Investointihyödykk. luovutustulot"," - Investointimenot"," + Rahoitusosuudet investointimenoihin"," + Investointihyödykkeiden luovutustulot"," - Investointimenot"," + Rahoitusosuudet investointimenoihin"," + Investointihyödykkeiden luovutustulot","Pitkäaikaisten lainojen lisäys"," ± Lyhytaikaisten lainojen muutos","Pitkäaikaisten lainojen lisäys"," ± Lyhytaikaisten lainojen muutos","Pitkäaikaisten lainojen lisäys"," ± Lyhytaikaisten lainojen muutos","Lainakanta","josta pitkäaik","josta lyhytaik","Lainasaamiset","Lainakanta","josta pitkäaik","josta lyhytaik","Lainasaamiset","Lainakanta","josta pitkäaik","josta lyhytaik","Lainasaamiset","Takaukset muiden puolesta (jäljellä oleva pääoma)","Takaukset muiden puolesta (jäljellä oleva pääoma)","Takaukset muiden puolesta (jäljellä oleva pääoma)","Vuokravastuut","Vuokravastuut","Vuokravastuut"]
[20,"Akaa",16391,null,11.406287787182588,56.0820333898873,-4964.1266548715757,null,null,null,23.590750124901863,803.73375632969316,25.097131464122427,11689.097675553658,null,84365,170341,531,-85445,64150,39506,null,null,-147,338,18402,8763,0,null,9639,-409,0,227,-18,8986,-1092,15626,null,-1427,-1190,258,null,null,null,null,22.25,null,98,16467,null,-2.3134539090139343,70.221085268200213,-6867.9055656768087,null,null,null,24.007304715825335,936.64715309406688,29.806207152485563,11469.966947835064,null,74655.443090000001,170101.73947999999,528.20762999999999,-94918.088759999999,66852.587299999999,37078.345000000001,null,null,-770.53986999999995,344.24124999999998,8586.5449200000003,7196.6401900000001,0,null,1389.90473,-620.15559999999994,0.41266000000000003,-328.71217999999999,-8.5896900000000009,1090.2842800000001,1109.3043599999999,8871.6319499999991,null,-1401.2997800000001,-5282.7286100000001,-13276.62081,null,null,null,null,22.25,null,266,16473,null,0.93119091620011407,77.142611055776499,-7113.8127827353856,null,null,null,18.493719268453649,567.25003399502214,16.290895468491449,12709.323610149944,null,71683.581260000006,173187.90008000002,667.14194999999995,-100837.17687000001,69399.148969999995,38886.780200000001,null,null,-664.40382,379.58956999999992,7163.9380499999997,7608.3815100000002,24.892669999999999,null,-419.55079000000001,-252.44684000000001,1.2755999999999998,142.22542999999999,-33.408199999999994,-846.35566000000006,-580.21133000000009,6235.2962400000006,null,-821.74933999999996,-7770.2683299999999,-18730.073649999998,null,null,null,null,22,null,253,null,null,null,null,null,null,-19500,115,4017,-22861.21027,561.11209999999994,151.84541000000002,-27184.646800000002,528.25933999999995,1691.01757,16451,-13511,2124.33,19664.23733,35302.810450000004,-14372.780150000001,75779,62285,13494,7672,96008.079009999987,62274.914369999999,33733.164640000003,7675.2806100000007,109151.71983,82725.231579999992,26426.488249999999,7670.5319500000005,14631,null,null,15695,16100.275,11597.089199999999]
[5,"Alajärvi",9419,null,1.4540717582253981,50.949560810329857,-5587.2173266801146,null,null,null,33.041555581841841,1021.5521817602718,23.937933666862058,15576.388151608451,null,70222,131111,113,-60776,29583,40681,null,null,-373,273,9388,6287,0,null,3101,29,-21,64,-15,3031,7816,8946,null,213,-6338,427,null,null,null,null,21.75,null,133,9311,null,1.309435600283279,48.447652119604392,-5342.7002556116431,null,null,null,34.588154840374678,1117.0844667597466,25.21268295337693,16171.854106970251,null,74735.014909999998,137614.56435,119.25402,-62760.295420000002,31473.606629999998,40058.252249999998,null,null,-159.27240000000003,4.0926499999999946,8616.3837100000001,6224.4474400000008,0,null,2391.9362700000001,-30.44942,2.0238100000000001,52.445059999999998,-15.63209,2295.4335099999998,10065.630429999999,8466.4817700000003,null,-1079.41984,-6538.7760699999999,2657.9663300000002,null,null,null,null,21.75,null,127,9183,null,1.0415161776171413,45.793077355428863,-5345.478766198411,null,null,null,33.302222615640957,994.17710661004025,21.548509244461783,16839.895502559077,null,73503.042719999998,140554.40445,196.04211999999998,-66855.319610000006,32479.353719999999,41621.538659999998,null,null,-247.82696999999999,61.47332999999999,7059.2191299999995,6370.9837200000002,0,null,688.23541,16.029489999999999,0,25.311910000000001,-2.8101100000000003,676.14287999999999,9487.72156,6612.2325000000001,null,1700.07755,-6767.44733,1758.7443899999998,null,null,null,null,21.75,null,144,null,null,null,null,null,null,-8822,275,28,-5956.1677399999999,75.325800000000001,72.326499999999996,-5728.4627499999997,401.59066999999999,473.38396999999998,7058,64,4788.3185899999999,2009.2352800000001,1473.6714399999998,74.838250000000002,51214,40348,10866,0,50361.289509999995,37575.718569999997,12785.57094,95.427369999999996,45229.486730000004,33421.319390000004,11808.16734,92.870500000000007,498,null,null,1380,530.73875999999996,484.10521]
[9,"Alavieska",2517,null,0.59001512859304084,41.539116853613514,-3014.700039729837,null,null,null,41.55028477802918,2144.6166070719109,49.98782189521755,15659.515295987287,null,16575,32888,1,-16312,7712,10928,null,null,10,12,2350,1045,0,null,1305,0,-3,0,-1,1301,2931,2477,null,468,-3976,1193,null,null,null,null,22,null,165,2491,null,24.082679383512417,46.080500942475673,-3217.8767924528292,null,null,null,39.518555059662006,2665.0117824167,65.176882986970284,14924.452597350457,null,17280.944149999999,34291.8393,0.41947000000000001,-17010.47568,8349.3924800000004,10378.9588,null,null,92.126180000000005,19.232299999999999,1829.2340800000002,1092.3789400000001,0,null,736.85514000000001,-0.12127,-8.6459999999999995E-2,1.53162,-0.21925999999999998,734.89652999999998,3665.0294599999997,1811.36951,null,-185.26324,-33.953300000000006,-540.53579999999999,null,null,null,null,22,null,197,2447,null,29.082239952236421,44.425831205692106,-2917.934499387005,null,null,null,42.886073951626074,3085.8764568859829,71.871936017545679,15671.553727012664,null,17797.693850000003,35441.338619999995,3.8393899999999999,-17639.805379999998,9070.3866600000001,11441.820460000001,null,null,312.18932000000001,-187.12994,2997.4611199999999,1173.77602,0,null,1823.6851000000001,-0.61714000000000002,-2.4397899999999999,1.0835699999999999,-2.6600000000000002E-2,1819.518,5512.2818499999994,3028.84762,null,5.4924399999999993,-54.926230000000004,721.95402000000001,null,null,null,null,22,null,47,null,null,null,null,null,null,-1856,13,559,-2582.2359000000001,-3.8139699999999999,234.14455999999998,-2380.2151699999999,6.8373599999999994,66.484210000000004,597,4508,620.1,990.72,963.8,-0.99478,11249,1191,10058,57,12825.894109999999,1787.9478799999999,11037.94623,220.09586999999999,13563.918800000001,2458.3458700000001,11105.57293,231.29587000000001,2732,null,null,193,97.76,29.539080000000002]
[10,"Alavus",11332,null,1.7959693537641572,65.19184533807595,-5382.3685139428171,null,null,null,38.556864660277149,2590.0105894811154,66.778142785012122,14156.636074832333,null,73727,142464,488,-68249,34963,43125,null,null,-534,906,10211,8085,0,null,2126,-5,29,21,-64,2065,28359,9415,null,10985,-5432,-1708,null,null,null,null,21.25,null,191,11197,null,1.127115969230454,64.72786780915682,-5575.2882182727517,null,null,null,36.148595244328114,2830.315618469233,66.263097193214051,15590.354880771634,null,85046.807680000013,156608.72237,427.41189000000003,-71134.502800000002,36731.159960000005,42180.877,null,null,-362.53467999999998,1036.1592000000001,8451.1586800000005,7934.9053400000003,0,null,516.25333999999998,2.0571100000000002,32.68826,21.30397,-14.99297,514.70177000000001,26732.911780000002,7933.9877999999999,null,3058.1972099999998,-7453.1903200000006,-174.43682000000001,null,null,null,null,21.25,null,193,11102,null,0.85155867453042078,65.555255438802888,-6164.3037659881102,null,null,null,34.033768028132108,2761.535043235453,61.991903211640434,16259.547433795713,null,83034.939939999997,158446.12218999999,578.37410999999997,-74832.808139999994,37647.463219999998,45138.767,null,null,-499.13365999999996,-844.76071000000002,6609.5277100000003,8271.5507899999993,0,null,-1662.0230800000002,28.142869999999998,19.38,14.484639999999999,-34.455059999999996,-1663.4399099999998,23149.482379999998,5787.0686900000001,null,5950.0657000000001,-7854.79331,-5118.5433700000003,null,null,null,null,21.25,null,206,null,null,null,null,null,null,-12011,591,297,-9385.3234800000009,405.11802,871.78084000000001,-11838.00359,463.78228999999999,468.60924,11822,-4269,11457.62666,2251.7456699999998,11399.4247,-1212.14319,80862,73460,7402,1957,87375.734329999992,77207.701560000001,10168.03277,1717.8006699999999,89987.110780000003,81178.58726,8808.5235199999988,1737.1893500000001,1299,null,null,2372,2297.5569999999998,2013.722]
[16,"Asikkala",8059,null,13.188106796116505,26.382677324698978,-2044.2983000372258,null,null,null,58.082631367829926,693.01402159076804,21.775623564599691,11616.205484551432,null,42719,87980,7,-45254,31842,24269,null,null,-130,1,10728,4146,0,null,6582,-2,0,1,-57,6522,16120,10566,null,822,-685,6435,null,null,null,null,20.75,null,46,8033,null,26.205319454478641,28.119605683894381,-1711.0458844765342,null,null,null,57.737212059196523,996.77195568280843,29.103034324484419,12501.162585584465,null,45635.029109999996,93826.837680000011,15.396850000000001,-48176.411719999996,32558.65653,22828.62573,null,null,129.14564000000001,-4.2824900000000055,7335.7336799999994,3604.2620899999997,0,null,3731.4715899999997,-0.63244,0,0.10047,-24.822200000000002,3705.9164700000001,20083.543870000001,7462.3021699999999,null,-2387.0094800000002,-207.05206000000001,2256.3604999999998,null,null,null,null,20.75,null,132,8014,null,19.179203928187093,33.163915099366463,-2936.0306987771396,null,null,null,53.955895199068543,699.31444721736966,16.992690657823001,15021.151056900426,null,48764.511060000004,102135.31515000001,-16.533049999999999,-53387.337149999999,33560.072229999998,25532.793719999998,null,null,-78.366129999999998,495.80898999999999,6122.9716600000002,3580.5704300000002,-13.672120000000001,null,2528.7291099999998,0.69516,-0.52194000000000007,-2.8000000000000003E-4,-4.4350899999999998,2524.4675200000001,23193.11922,6780.3546299999998,null,21.00196,-263.47501,-10802.39416,null,null,null,null,20.75,null,146,null,null,null,null,null,null,-4516,25,360,-6181.8309400000007,4.6415699999999998,971.24770999999998,-17787.586629999998,83.225970000000004,121.61186000000001,0,-5668,3204.81,-2250.89527,1598.4,5076.2871699999996,13084,7002,6082,132,13830.882300000001,9461.1857300000011,4369.6965700000001,82.976520000000008,20242.09446,10208.17641,10033.91805,68.60202000000001,0,null,null,13868,14812.174000000001,16438.077269999998]
[18,"Askola",4878,null,2.681174089068826,79.464790501915942,-5142.886428864289,null,null,null,28.019906499773789,2148.4214842148422,77.656421291972876,10097.990979909799,null,17350,42794,-1,-25445,20456,9951,null,null,-219,330,5073,2989,0,null,2084,-1,6,11,0,2078,3673,5034,null,1301,-1751,865,null,null,null,null,21.5,null,117,4847,null,1.8533711267425572,75.187303780310458,-4806.6389292345775,null,null,null,31.948799684812478,2201.0252032184858,77.381215184236154,10382.031314214979,null,19746.70175,45897.21299,0.6855,-26149.825739999997,21255.042739999997,8349.6579999999994,null,null,-117.35342,409.63983000000002,3747.1614100000002,2187.3330899999996,0,null,1559.8283200000001,-2.3455400000000002,-2.4400200000000001,0,-13.45748,1541.58528,6265.7131900000004,3540.37345,null,-748.11305000000004,-1954.88995,1712.5248799999999,null,null,null,null,21.5,null,189,4763,null,1.4083317938380251,68.782272534923862,-4551.5685135418862,null,null,null,34.34340920927341,2173.3800083980686,72.269288716612522,10976.774742809153,null,19409.226549999999,47234.529040000001,-175.72783999999999,-28001.030329999998,22920.387469999998,8769.3430000000008,null,null,-213.20112,-252.34680999999995,3223.1522099999997,2154.83716,0,null,1068.3150500000002,0.57530999999999999,-128.66480999999999,11.68155,0,928.54399999999998,7338.8859900000007,3029.1271000000002,null,351.76943,-2221.06306,1341.0392199999999,null,null,null,null,21.5,null,180,null,null,null,null,null,null,-4429,132,128,-2243.1296499999999,3.8641999999999999,411.41687999999999,-1902.26423,5.1803599999999994,208.99598999999998,726,3270,294.12446,0,462.17065000000002,-1010.2144599999999,32665,24845,7820,0,30993.603050000002,23242.84503,7750.7580199999993,4.1460000000000004E-2,28251.469130000001,21556.780780000001,6694.6883499999994,0,2000,null,null,1267,2709.6401000000001,2779.0159100000001]
[19,"Aura",3959,null,2.2308132875143185,52.070246353853719,-3303.3594342005558,null,null,null,31.96777277072238,1051.2755746400605,42.307349541872057,9069.7145743874717,null,12469,32750,9,-20272,15595,8550,null,null,-63,21,3831,1367,0,null,2464,-32,-66,0,-15,2350,3988,3888,null,129,-1682,2393,null,null,null,null,21.5,null,141,3955,null,2.1736892165567081,41.887666989550908,-2688.3374740834388,null,null,null,39.744699353587315,754.66017699115048,29.144672807836479,9451.1599570164381,null,13970.65717,34545.431600000004,11.330500000000001,-20563.443930000001,15987.4943,7934.6962599999997,null,null,-54.416849999999997,39.709890000000001,3344.0396700000001,1356.51369,0,null,1987.5259799999999,-14.807169999999999,-26.869630000000001,3.7350000000000001E-2,-8.0399999999999991,1937.7718300000001,5924.3607000000002,3273.64509,null,-383.83216999999996,-1508.51559,2242.5352699999999,null,null,null,null,21.5,null,157,3965,null,1.5354698199588088,46.599954574994669,-3037.2447515762929,null,null,null,35.097496913856119,926.33871374527109,32.771547792982659,10317.292080706178,null,13741.87658,36512.070540000001,-5.2591800000000006,-22775.453140000001,16693.933199999999,7963.9655700000003,null,null,-87.627320000000012,48.156960000000005,1842.9752699999999,1429.92283,0,null,413.05243999999999,-38.768149999999999,-83.826630000000009,0.14141000000000001,-20.323400000000003,269.99284999999998,5776.9669399999993,1824.21921,null,452.78053000000006,-1167.4847400000001,-1175.7424599999999,null,null,null,null,21.5,null,244,null,null,null,null,null,null,-1397,20,-118,-1261.9266299999999,87.848460000000003,142.96835000000002,-3111.0809800000002,67.231399999999994,43.887910000000005,132,592,289.84802000000002,-2102.57528,3976.3372200000003,-2237.5767500000002,14602,6082,8520,0,11281.25626,5092.72109,6188.5351700000001,0,11852.531989999999,7520.6075700000001,4331.9244200000003,0,773,null,null,1570,117103.27701000001,10436.174429999999]
[46,"Enonkoski",1369,null,191.8,17.468672846694925,1962.7465303140978,null,null,null,75.682094653304759,3822.4981738495253,93.382467976923834,14940.832724616508,null,10495,19664,0,-9169,4642,6330,null,null,-9,115,1909,792,6,null,1123,0,0,0,3,1126,8046,1830,null,22,-1,1194,null,null,null,null,21,null,36,1362,null,124.75563503521278,18.304521292668515,2870.3868355359764,null,null,null,71.646265773586663,4800.2484728340678,110.75274557390118,15819.839801762113,null,11393.02312,20505.46963,0,-9112.4465099999998,5024.6173499999995,6152.5808099999995,null,null,-2.9621200000000001,127.47991999999999,2189.2694500000002,784.02490999999998,0,null,1405.2445400000001,0,2.4837399999999996,0,1.4934000000000001,1409.2216799999999,9430.5699000000004,2182.58302,null,-299.38346999999999,-7.6370500000000003,1252.0501299999999,null,null,null,null,21,null,19,1341,null,56.483500536206897,20.670838467675587,2806.0259433258761,null,null,null,71.058687236440917,5319.0299105145414,111.467156712841,17417.20139448173,null,11315.894490000001,21512.980079999998,0,-10197.085590000001,5157.2429199999997,6663.5733600000003,null,null,-15.096279999999998,66.644880000000001,1675.2792899999999,811.87175999999999,26.982310000000002,null,890.38983999999994,0,0,0,0.79634000000000005,891.18618000000004,10315.152,1679.94893,null,90.285629999999998,-1.0690999999999999,-83.54692,null,null,null,null,21,null,44,null,null,null,null,null,null,-771,1,134,-1010.00338,52.448779999999999,27.021709999999999,-1768.9834099999998,1.04718,4.4403800000000002,387,-63,537.59133999999995,-198.14802,228.52073000000001,177.61217000000002,1129,880,249,0,1460.11961,1264.0976900000001,196.02192000000002,5.44,1865.1834199999998,1311.3798400000001,553.80358000000001,7,108,null,null,415,380.47765999999996,396.45865000000003]
{"$rows_left_out":286}