{"text_format":"1","workbook":"xlsx","n_sheets":2,"sheets":["Kuntakortti","Luvut"],"not_rendered":{"charts":1,"images":0,"macros":1,"external_links":0,"defined_names":2,"comments":0,"pivot_tables":0},"unopened":[],"bounds":{"document_bytes":16777216,"sheet_cells":100000,"rows_first":2000,"rows_last":500,"rows_between":2000,"halvings":0,"cell_chars":16384,"cell_head_chars":4096},"cells_cut":0,"cells_raw":0,"read":"whole","date_system":"1900"}

{"sheet":"Kuntakortti","index":0,"n_rows":83,"n_cols":20,"rows_kept":83,"cut":false,"hidden":false,"merged":[[1,6,1,7]]}
["Valtiovarainministeriö/Kunta- ja alueosasto, 21.8.2023"]
["KUNTIEN LOPULLISET TP:T 2020 - 2022 ",null,null,null,null,null,"Valitse kunta valikosta:"]
[null,null,null,null,null,null,null," "]
[{"$f":"INDEX(Luvut!$B$3:'Luvut'!$B$296,$A$7)","v":"KOKO MAA (Manner-Suomi)"},null,null,2020,null,null,2021,null,null,2022]
[]
["Asukasluku",null,null,{"$f":"VLOOKUP($A$4,Luvut!$B$3:$AT$296,2)","v":5503664},null,null,{"$f":"VLOOKUP($A$4,Luvut!$B$3:$ED$296,46)","v":5517897}," ",{"$f":"((G6/D6)-1)*100","v":0.25860953721013047},{"$f":"VLOOKUP($A$4,Luvut!$B$3:$ED$296,90)","v":5533611}," ",{"$f":"((J6/G6)-1)*100","v":0.284782408950357},null,null,null,null,"Kunta"]
[95,null,null," ",null,null,null,null,null,null,null,null,null,null,null,null,null,2020,2021,2022]
["Tunnuslukuja",null,null," ",null,null,null,null,null,null,null,null,null,null,null,null,"Vuosikate",{"$f":"D36","v":4072986},{"$f":"G36","v":3786456.8943100246},{"$f":"J36","v":3442012.4175800011}]
[null,null,null," "," "," "," ",null,"muutos%"," ",null,"muutos%",null,"Konsernivelka, €","Konsernivelka, €","Konsernivelka, €","Poistot",{"$f":"D38","v":2397525},{"$f":"G38","v":2411475},{"$f":"J38","v":2450985.9136899984}]
["Lainat, euro/as",null,null,{"$f":"E67","v":3458.3115902424274}," ",null,{"$f":"H67","v":3465.7604156076127},null,{"$f":"((G10/D10)-1)*100","v":0.21538907558826814},{"$f":"K67","v":3378.0821138077781},null,{"$f":"((J10/G10)-1)*100","v":-2.5298431306730373},null,2020,2021,2022,"Tilikauden tulos",{"$f":"D41","v":1756705},{"$f":"G41","v":1485638.6467899999},{"$f":"J41","v":1160444.2090799981}]
{"$rows_left_out":74}
{"sheet":"Luvut","index":1,"n_rows":296,"n_cols":178,"rows_kept":296,"cut":false,"hidden":false,"merged":[]}
[null,null,2020,null,null,null,null,null,null,null,null,null,null,null,null,null,null,null,null,null,108,null,110,111,112,113,114,115,116,117,118,119,120,121,122,null,124,125,126,127,128,129,130,131,132,133,20201,null,92,93,94,95,96,97,98,99,100,101,102,103,104,105,106,107,108,109,110,111,112,113,114,115,116,117,118,119,120,121,122,123,124,125,126,127,128,129,130,131,132,133,2022,null,92,93,94,95,96,97,98,99,100,101,102,103,104,105,106,107,108,null,110,111,112,113,114,115,116,117,118,119,120,121,122,123,124,125,126,127,128,129,130,131,132,133,"Erillistiedot",135,136,137,138,139,2020,144,145,2021,147,148,2022,147,148,2020,152,2021,154,2022,null,2020,160,161,162,2021,164,165,166,2022,167,168,169,2020,2021,2022,"Yhden vero%:n","Yhden vero%:n"]
["Kunta nro","Kunta",null,null,"Lainanhoitokate","Suht. velkaantuneisuus-%","Rahoitusvarallisuus, e/as",null,null,null,"Omavaraisuusaste, %","Rahavarat e/as","Kassan riittävyys, pv","Kassasta maksut, €/as","Henkilöstökulut","Toimintatuotot","Toimintakulut","Toimintakate","Verotulot","Valtionosuudet",null,null,"Korkotuotot/-menot, netto","Muut rahoitustuotot/-menot, netto (sis Osinkotuotot)","Vuosikate","Suunnitelman mukaiset poistot ja arvonalet","Satunnaiset tuotot","Satunnaiset kulut","Tilikauden tulos","Poistoeron lisäys(-) tai vähennys(+)","Varausten lisäys(-) tai vähennys(+)","Rahastojen lisäys(-) tai vähennys(+)","Tilikauden yli- tai alijäämä","Kumulat yli/alij","Tulorah (toiminnan rahavirta)",null,"Saamisten muutos ","Pitkäaikaisten lainojen vähennys","Toim ja inv rahavirta","Verotulot","Kunnallisvero","Osuus yhteisöveron tuotosta","Kiinteistövero","Tuloveroprosentti",null,"Sijoitus vuosikatteen mukaan","Asukasluku ",null,"Lainanhoitokate","Suht. velkaantuneisuus-%","Rahoitusvarallisuus, e/as",null,null,null,"Omavaraisuusaste, %","Rahavarat e/as","Kassan riittävyys, pv","Kassasta maksut, €/as","Henkilöstökulut","Toimintatuotot","Toimintakulut","Toimintakate","Verotulot","Valtionosuudet",null,null,"Korkotuotot/-menot, netto","Muut rahoitustuotot/-menot, netto (sis Osinkotuotot)","Vuosikate","Suunnitelman mukaiset poistot ja arvonalet","Satu. tuotot","Satu. kulut","Tilikauden tulos","Poistoeron lisäys(-) tai vähennys(+)","Varausten lisäys(-) tai vähennys(+)","Rahastojen lisäys(-) tai vähennys(+)","Tilikauden yli- tai alijäämä","Kumulat yli/alij","Toiminnan rahavirta",null,"Saamisten muutos ","Pitkäaikaisten lainojen vähennys","Toim ja inv rahavirta","Verotulot","Kunnallisvero","Osuus yhteisöveron tuotosta","Kiinteistövero","Tuloveroprosentti ",null,"Sijoitus vuosikatteen mukaan","Asukasluku",null,"Lainanhoitokate","Suht. velkaantuneisuus-%","Rahoitusvarallisuus, e/as",null,null,null,"Omavaraisuusaste, %","Rahavarat e/as","Kassan riittävyys, pv","Kassasta maksut, €/as","Henkilöstökulut","Toimintatuotot","Toimintakulut","Toimintakate","Verotulot","Valtionosuudet",null,null,"Korkotuotot/-menot, netto","Muut rahoitustuotot/-menot, netto (sis Osinkotuotot)","Vuosikate","Suunnitelman mukaiset poistot ja arvonalet","Satu. tuotot","Satu. kulut","Tilikauden tulos","Poistoeron lisäys(-) tai vähennys(+)","Varausten lisäys(-) tai vähennys(+)","Rahastojen lisäys(-) tai vähennys(+)","Tilikauden yli- tai alijäämä","Kumulat yli/alij","Toiminnan rahavirta",null,"Saamisten muutos ","Pitkäaikaisten lainojen vähennys","Toim ja inv rahavirta","Verotulot","Kunnallisvero","Osuus yhteisöveron tuotosta","Kiinteistövero","Tuloveroprosentti ",null,"Sijoitus vuosikatteen mukaan","Palvelujen ostot 2020","Palvelujen ostot 2021","Palvelujen ostot 2022","Harkvar2020","Harkvar2021","Harkvar2022"," - Investointimenot"," + Rahoitusos. investointimenoihin"," + Investointihyödykk. luovutustulot"," - Investointimenot"," + Rahoitusosuudet investointimenoihin"," + Investointihyödykkeiden luovutustulot"," - Investointimenot"," + Rahoitusosuudet investointimenoihin"," + Investointihyödykkeiden luovutustulot","Pitkäaikaisten lainojen lisäys"," ± Lyhytaikaisten lainojen muutos","Pitkäaikaisten lainojen lisäys"," ± Lyhytaikaisten lainojen muutos","Pitkäaikaisten lainojen lisäys"," ± Lyhytaikaisten lainojen muutos","Lainakanta","josta pitkäaik","josta lyhytaik","Lainasaamiset","Lainakanta","josta pitkäaik","josta lyhytaik","Lainasaamiset","Lainakanta","josta pitkäaik","josta lyhytaik","Lainasaamiset","Konsernilainat €/as","Konsernilainat €/as","Konsernilainat €/as","tuotto","tuotto, €/as"]
[20,"Akaa",16391,null,3.2927056196501674,54.56404061055224,-3487.7066682935756,null,null,null,33.645378594008733,528.5827588310658,23.687735015205764,8144.8355805014944,44739,28305,112143,-83838,64150,36698,null,null,99,378,17487,5748,0,0,11739,20,0,0,11757,2911,12838,null,620,-5166,3234,64150,59104,1773,3273,22.25,null,22.794117647058901,16467,null,5.4305823132944706,70.206493812349166,-4418.7429434626838,null,null,null,28.327995958111888,543.04075545029445,22.949373725818916,8636.8315801299559,46010.27304,24031.753720000004,121903.69687999999,-97871.943159999995,66852.587299999999,34427.230000000003,null,null,-441.56817000000007,389.65987000000001,3355.9658400000008,4349.0901100000001,0,0,-993.12426999999957,-3.1373800000000003,0,0,-989.98689000000002,1921.4892799999998,3109.88267,null,-1668.9309800000001,-4894,-15571.872880000001,66852.587299999999,60897.137590000006,2439.1327299999998,3516.3169800000001,22.25,null,273,16473,null,0.59808137101179726,79.188957893400953,-5568.4314994232991,null,null,null,24.566222572477681,279.10912159290956,11.147846247239981,9138.5212104656093,46586.32144,23888.967980000001,126066.88182,-102177.91384000001,69399.148969999995,35933.279999999999,null,null,-490.61770999999999,501.25173999999998,3165.1491599999999,4662.7954300000001,57.668300000000002,0,-1439.9779699999999,-2.6667700000000001,0,0,-1437.3111999999999,484.17808000000008,2782.52072,null,575.48973000000001,-5851.4936399999997,-19178.006170000001,69399.148969999995,62911.296040000001,2663.49712,3824.35581,22,null,252,50719,60800.32692,64111.944590000006,null,1250,null,-16001,115,6282,-19554.5867,561.11209999999994,311.71904999999998,-23644.833480000001,528.25933999999995,1156.0472500000001,12000,-8000,0,16114.409180000001,33000,-14043.28724,52444,40805,11639,7647,68557.508930000011,37055.36881,31502.14012,7235.2380700000003,81662.728049999991,60848.935359999996,20813.792690000002,7655.2380700000003,4623.2078579708377,5830.3321193902948,6626.098453833546,{"$f":"(DY3/EB3)","v":2859.6043654545456},{"$f":"(FO3/CM3)*1000","v":173.59341743790117},null,null,null,null,null,{"$f":"BQ3/AU3*1000","v":203.79946802696304}]
[5,"Alajärvi",9419,null,1.3470940959409594,37.566943096129393,-3337.7216264996282,null,null,null,44.059835142794292,478.6070708143115,14.18013219921232,12319.460664614078,45160,43439,106079,-62640,29583,38640,null,null,-186,252,5649,3584,0,0,2065,0,0,0,2065,7833,5646,null,-298,-4144,322,29583,25512,2144,1927,21.75,null,184.97794117647001,9311,null,1.0882863891193786,37.693969918597332,-3390.6536440768982,null,null,null,43.679848812022492,514.54376329073148,14.548999473169937,12908.686535280851,46534.569670000004,47201.90683,111541.31578,-64339.408950000005,31473.606629999998,37501.948039999996,null,null,-120.57539,170.04986,4685.6201899999951,3827.3159300000002,0,0,858.30425999999466,0,0,0,858.30426,8691.0721200000007,4719.1541500000003,null,-1427.7840900000001,-4294.4219999999996,726.39552000000003,31473.606629999998,26214.4548,3078.7167300000001,2180.4351000000001,21.75,null,180,9183,null,1.009879885636654,34.236366391048783,-3297.6303822280302,null,null,null,46.089523378363587,489.76858760753572,13.925896856382856,12836.913580529239,46797.929130000004,46334.500719999996,113421.69095999999,-67087.190239999996,32479.353719999999,39080.69485,null,null,11.40849,4.0746499999999655,4488.3414699999994,3848.1423199999999,0,0,640.19915000000003,0,0,0,640.19915000000003,9331.2712699999993,4362.1742000000004,null,1847.4792199999999,-4444.4309999999996,1072.5828999999999,32479.353719999999,26872.7009,3231.5692000000004,2375.0836200000003,21.75,null,153,48993,52826.413240000002,54084.865969999999,null,null,null,-5620,275,21,-4136.1754900000005,74.45,68.966859999999997,-4156.8616899999997,394.10199999999998,473.16838999999999,4000,0,4000,2000,0,0,27715,19420,8295,536,29419.923999999999,18975.492999999999,10444.431,611.80408,24975.492999999999,15462.648999999999,9512.8439999999991,604.90837999999997,5437.3075698057119,5408.7949210611105,4925.3497473592515,1235.5264781609196,134.54497203102687,null,null,null,null,null,503.23490387713412]
[9,"Alavieska",2517,null,0.49544072948328266,56.152367811560637,-2744.1398490266188,null,null,null,45.631758679567447,1490.2661899086213,56.911294010059443,9557.8069129916566,4572,2476,18348,-15872,7716,10101,null,null,15,11,1971,705,0,0,1266,0,0,0,1267,2090,1843,null,233,-3963,1594,7716,6711,305,700,22,null,96.330882352941202,2491,null,51.5204350698857,62.723571906253923,-2853.2203492573267,null,null,null,44.615698016608356,1960.3987956643919,88.448234567896705,8089.992569249297,4837.7588699999997,2469.5136499999999,19037.677879999999,-16568.164229999998,8352.9908599999999,9572.6479999999992,null,null,126.93082000000001,6.5788900000000012,1490.9843400000018,738.17448000000002,0,0,752.80986000000178,0,0,0,752.80985999999996,2843.1363199999996,1498.8438999999998,null,-65.291660000000007,0,403.4846,8352.9908599999999,7136.8307199999999,469.54071999999996,746.61941999999999,22,null,129,2447,null,70.71587980386154,54.038831335618987,-2153.3149938700449,null,null,null,50.122747841573563,2345.8692398855742,98.34272169372484,8706.717261953414,5025.6037999999999,2801.2947200000003,19875.14285,-17073.848129999998,9098.6300199999987,10638.034,null,null,341.37871000000001,-191.22508000000002,2812.9695200000001,815.50556999999992,0,0,1997.4639499999998,0,0,0,1997.4639499999998,4840.6002699999999,2864.1480799999999,null,-367.90282999999999,0,1938.12933,9098.6300199999987,7872.1357300000009,442.59866999999997,783.89562000000001,22,null,14,12132,12412.43849,12862.8951,null,null,null,-1061,11,801,-1312.0875900000001,4.7237900000000002,212.00450000000001,-975.31451000000004,3.3969899999999997,45.898769999999999,0,4500,0,1321.1592900000001,0,-236.26230999999999,10000,0,10000,774,11000,0,11000,1410,11000,0,11000,1591.2,4469.209376241557,5148.8936611802483,5543.0808336738874,357.82435136363642,146.22981257198057,null,null,null,null,null,598.54851063829858]
[10,"Alavus",11332,null,1.2806647940074907,63.145369428957686,-2458.6127779738795,null,null,null,49.576604180095543,2285.9159901164844,98.138525891865527,8501.8531591951996,23589,11612,85363,-73751,35072,43125,null,null,-106,837,5177,4032,0,0,1145,0,0,0,1145,22489,5031,null,9535,-3978,-1397,35072,29760,2810,2502,21.25,null,240.38235294117601,11197,null,0.83566273184302953,68.885717962156818,-2815.5570768955968,null,null,null,45.004122934177644,2521.9884585156742,101.51035752987197,9068.2942091631685,24808.294859999998,13815.95536,90507.812709999998,-76691.857349999991,36841.078780000003,42180.877,null,null,-71.812930000000023,1182.2317800000001,3440.5172800000073,4321.4855399999997,0,0,-880.96825999999282,0,0,0,-880.96825999999999,19022.54681,3297.75234,null,-1152.77548,-4165.0276400000002,-1391.2062800000001,36841.078780000003,30170.763579999999,3934.9839200000001,2735.3312799999999,21.25,null,249,11102,null,0.53169410936487427,72.185029287513373,-3324.3472338317415,null,null,null,42.328379497574389,2507.3637137452711,98.90533820330738,9253.1684552332918,23602.765940000001,11230.238139999999,90798.662909999999,-79568.424769999998,37759.578959999999,45138.767,null,null,-130.93473,-809.86651000000006,2389.1199500000002,4439.9894999999997,0,0,-2050.8695499999999,0,0,0,-2050.8695499999999,16971.677259999997,2125.9199700000004,null,948.69875999999999,-4756.308,-7091.5200400000003,37759.578959999999,30819.23618,4217.3695800000005,2722.9732000000004,21.25,null,244,54746,57796.276899999997,59376.725709999999,null,null,null,-6980,262,290,-5949.2176399999998,402.39802000000003,857.86099999999999,-10030.14149,440.52447999999998,372.17700000000002,7400,-3000,9000,2000,10700,-2000,45665,41500,4165,7195,52499.695,45743.387000000002,6756.308,6763.1732099999999,56443.387000000002,51185.046999999999,5258.34,6570.5465100000001,7135.7218496293681,7803.4950727873538,8105.486469104665,1450.3169967058823,130.63565093729798,null,null,null,null,null,307.27134768241558]
[16,"Asikkala",8059,null,160.92592592592592,10.143804937190584,-381.06464821938204,null,null,null,87.028956763189214,110.80779253009058,6.1119653471844586,6617.3222484179178,13872,5611,50709,-45098,31883,21892,null,null,-44,13,8646,2509,0,0,6137,94,-5000,0,1231,12238,8594,null,-1107,-10,6563,31883,27480,1731,2672,20.75,null,21.786764705882401,8033,null,158.49364968902617,11.330913450331995,21.160003734594863,null,null,null,86.555134386353174,375.64488733972365,18.849451917774029,7273.9719158471316,15001.369500000001,6449.0445199999995,53598.337700000004,-47149.293180000008,32598.166870000001,20316.576000000001,null,null,-37.030470000000001,103.64464999999998,5832.0638699999936,2388.0197000000003,0,0,3444.0441699999933,-94.281679999999994,3000,0,538.32584999999995,13033.76952,5832.06387,null,-1561.22552,0,2724.3410099999996,32598.166870000001,27175.237679999998,2474.8977200000004,2948.0314700000004,20.75,null,80,8014,null,99.754746269142046,20.835700123744154,-1186.7380184676815,null,null,null,78.676973565472039,129.91631145495381,5.1249075184229778,9252.7432954829055,15841.335300000001,6494.06682,58984.817999999999,-52490.751179999999,33600.615509999996,23134.317999999999,null,null,-32.33475,414.30451999999997,4626.1520999999993,2306.2383100000002,0,0,2319.9137900000001,-94.281679999999994,0,0,2414.1954700000001,16039.653990000001,4308.97876,null,1256.3452,-9.9,-10594.836710000001,33600.615509999996,27954.874670000001,2546.5694900000003,3099.1713500000001,20.75,null,107,33295,34503.988239999999,38769.066479999994,null,null,null,-2276,19,226,-4674.5150199999998,0,1566.79216,-15045.720710000001,77.75,64.155239999999992,0,-5500,0,-509.9,0,5700,1945,1435,510,791,1434.9,1425,9.9,747.37869999999998,7125.0000000000009,1409.1,5715.9,747.37869999999998,1623.5264921206106,1721.7580356031372,2525.8415847267283,1347.2228756626507,168.10866928657984,null,null,null,null,null,726.01317938503598]
[18,"Askola",4878,null,2.606299212598425,81.299611796743733,-3670.5617056170563,null,null,null,33.043519687477669,1757.8925789257892,87.3291015625,7347.273472734727,13415,4111,30586,-26475,20456,9951,null,null,-173,366,4125,2141,0,0,1984,0,0,0,1983,4631,4098,null,1047,-1473,694,20456,18369,1008,1079,21.5,null,72.154411764705898,4847,null,1.8581318771633317,78.403454193782252,-3298.3453331957917,null,null,null,35.961510920080748,1882.4753455745822,95.026572517496547,7230.6459438828142,13824.906919999999,5182.86463,32168.371190000002,-26985.506560000002,21255.042739999997,8349.6579999999994,null,null,-150.72920000000002,514.34118000000001,2982.806159999996,1512.6518999999998,0,0,1470.1542599999962,0,0,0,1470.15426,6101.4307500000004,2785.72516,null,-578.73562000000004,-1524.366,1923.49315,21255.042739999997,18635.854800000001,1445.0220200000001,1174.1659199999999,21.5,null,125,4763,null,1.3285492477452974,68.090192935124563,-3023.2793974385895,null,null,null,39.342584654233043,1925.0902057526769,94.083737752704764,7468.4312282175115,14431.784,5010.7848800000002,33885.77792,-28874.993039999998,22920.387469999998,8769.3430000000008,null,null,-174.63747999999998,-220.42312000000004,2419.6768299999999,1528.1799099999998,0,0,891.49692000000005,0,0,0,891.49692000000005,6992.92767,2322.8843299999999,null,742.84775999999999,-1773.9046000000001,1592.90246,22920.387469999998,20014.208589999998,1652.8688300000001,1253.31005,21.5,null,139,13433,14721.042579999999,15744.46379,null,null,null,-3582,114,64,-1205.1260199999999,0,342.89401000000004,-843.63162999999997,0,113.64976,0,3500,0,0,0,-1000,24997,17473,7524,0,23473.241090000003,16001.553330000001,7471.6877599999998,0,20699.336490000002,14325.43189,6373.9045999999998,0,6696.3919639196392,6394.3889106663919,5931.4442851144231,930.89342279069763,195.4426669726428,null,null,null,null,null,615.39223437177543]
[19,"Aura",3959,null,2.5459677419354838,55.662202663226978,-2722.9098257135638,null,null,null,32.438339057133938,799.94948219247283,45.569243505341582,6407.4261177064918,6688,2657,23226,-20569,15595,8107,null,null,-26,24,3131,893,0,0,2238,28,0,0,2266,2236,2883,null,203,-1214,2177,15595,14340,541,714,21.5,null,91.294117647058897,3955,null,2.5633733518884072,44.862438584529912,-2284.4447281921616,null,null,null,41.816267693689753,464.88789127686476,25.84503968949398,6565.4408874841965,7208.8252599999996,3069.4745600000001,24059.145710000001,-20989.671150000002,15987.4943,7510.7550000000001,null,null,-18.509580000000003,41.218499999999999,2531.2870699999985,885.66905000000008,0,0,1645.6180199999983,-27.787680000000002,0,0,1673.4057,3908.5385199999996,2453.3862000000004,null,-320.33348000000001,-976.19399999999996,1729.73783,15987.4943,14407.52326,740.52879000000007,839.44224999999994,21.5,null,108,3965,null,1.9770985627385151,46.002610063354609,-2345.0069356872636,null,null,null,40.952509476546204,568.45589155107189,30.306727163756037,6846.2160000000003,7594.0259500000002,3172.4813599999998,25895.736949999999,-22723.255590000001,16693.933199999999,7491.634,null,null,-45.192809999999994,90.534530000000018,1507.6533300000001,894.73348999999996,0,0,612.91984000000002,-27.787680000000002,0,0,640.70752000000005,4027.7160400000002,1485.4433799999999,null,11.782,-738.09400000000005,344.16955000000002,16693.933199999999,14935.18036,872.98568999999998,885.76715000000002,21.5,null,187,13287,14396.97301,15618.68318,540,null,null,-888,1,181,-935.00202000000002,73.466999999999999,137.88665,-1194.4440300000001,18,35.170199999999994,0,500,0,-2000,2500,-2500,12333,4357,7976,0,9357.1540000000005,3619.06,5738.0940000000001,0,8619.06,5000,3619.06,0,3688.3051275574639,2852.4036055625788,2989.2892786885245,694.65955162790704,175.19786926302825,null,null,null,null,null,640.02201517066965]
[46,"Enonkoski",1369,null,{"$error":"#DIV/0!"},11.057046979865772,2508.4002921840761,null,null,null,88.432256633897552,3284.8794740686631,151.81326304106548,7897.7355734112489,2445,1564,10567,-9003,4642,5745,null,null,8,110,1502,573,0,0,929,0,0,0,929,6955,1433,null,-279,0,1288,4642,3472,680,490,21,null,17.757352941176499,1362,null,8651.6793218720159,10.651739356883279,3637.9284214390609,null,null,null,82.994575624188116,4158.7211747430247,186.03392742236952,8159.443010279002,2609.9777000000004,1859.1443800000002,10779.093570000001,-8919.9491899999994,5024.6173499999995,5572.0309999999999,null,null,13.588100000000001,121.16499,1811.4522500000003,568.68366000000003,0,0,1242.7685900000004,0,0,0,1242.7685900000001,8197.9461899999988,1793.6407300000001,null,-360.47709999999995,0,1501.6923999999999,5024.6173499999995,3512.82071,973.22829999999999,538.56833999999992,21,null,8,1341,null,1378.0949685861156,11.670047939099497,3700.6865175242351,null,null,null,83.145803509968047,4689.3619686800894,176.55963780094595,9694.2718046234149,2687.27052,1736.70154,11693.377390000001,-9956.6758499999996,5157.2429199999997,6039.6,null,null,19.025469999999999,66.881059999999991,1326.0736000000002,545.48644999999999,0,0,780.58715000000007,0,0,0,780.58715000000007,8978.53334,1326.0736000000002,null,432.45702,0,41.823140000000002,5157.2429199999997,3683.7084399999999,905.87333999999998,567.66114000000005,21,null,29,7242,7167.4550099999997,7953.3004700000001,null,null,null,-275,0,130,-323.06711000000001,0,31.118779999999997,-1284.25046,0,0,0,0,0,0,0,0,0,0,0,236,0,0,0,197.91123000000002,0,0,0,194.29583,824.68955441928415,1072.0408296622613,1390.889947800149,175.41468761904761,130.8088647420191,null,null,null,null,null,1329.9943098384731]
{"$rows_left_out":286}