{"text_format":"1","workbook":"xlsx","n_sheets":2,"sheets":["Kuntakortti","Luvut"],"not_rendered":{"charts":0,"images":0,"macros":1,"external_links":0,"defined_names":2,"comments":0,"pivot_tables":0},"unopened":[],"bounds":{"document_bytes":16777216,"sheet_cells":100000,"rows_first":2000,"rows_last":500,"rows_between":2000,"halvings":0,"cell_chars":16384,"cell_head_chars":4096},"cells_cut":0,"cells_raw":0,"read":"whole","date_system":"1900"}

{"sheet":"Kuntakortti","index":0,"n_rows":79,"n_cols":15,"rows_kept":79,"cut":false,"hidden":false,"merged":[[1,6,1,7]]}
["Valtiovarainministeriö/Kunta- ja aluehallinto-osasto, 29.5.2020"]
["KUNTAKONSERNIEN TP 2017 - 2019 (lyhennetty kaava)",null,null,null,null,null,"Valitse kunta valikosta:"]
[null,null,null,null,null,null,null," "]
[{"$f":"INDEX(Luvut!$B$3:'Luvut'!$B$298,$A$7)","v":"KOKO MAA (Manner-Suomi)"},null,null,2017,null,null,2018,null,null,2019]
[]
["Asukasluku",null,null,{"$f":"VLOOKUP($A$4,Luvut!$B$3:$AV$298,2)","v":5483641},null,null,{"$f":"VLOOKUP($A$4,Luvut!$B$3:$EJ$298,48)","v":5488130}," ",{"$f":"((G6/D6)-1)*100","v":8.1861668187244163E-2},{"$f":"VLOOKUP($A$4,Luvut!$B$3:$EJ$298,94)","v":5495408}," ",{"$f":"((J6/G6)-1)*100","v":0.13261347672157697}]
[96,null,null," "]
["Tunnuslukuja",null,null," "]
[null,null,null," "," "," "," ",null,"muut.%"," ",null,"muut.%"]
["Lainat, euro/as",null,null,{"$f":"E66","v":6314.2279007688503}," ",null,{"$f":"H66","v":6557.6498734541638},null,{"$f":"((G10/D10)-1)*100","v":3.8551344124857057},{"$f":"K66","v":7105.3242998518035},null,{"$f":"((J10/G10)-1)*100","v":8.3516875247436673}]
[]
["Lainanhoitokate*",null,null,{"$f":"VLOOKUP($A$4,Luvut!$B$3:$AV$298,4)","v":1.8853791839128096}," ",null,{"$f":"VLOOKUP($A$4,Luvut!$B$3:$EJ$298,50)","v":1.5263679823177443},null,null,{"$f":"VLOOKUP($A$4,Luvut!$B$3:$EJ$298,96)","v":1.3569511103880256}]
["Suhteellinen velkaantuneisuus, %",null,null,{"$f":"VLOOKUP($A$4,Luvut!$B$3:$AV$298,5)","v":78.715524364417803}," ",null,{"$f":"VLOOKUP($A$4,Luvut!$B$3:$EJ$298,51)","v":80.756103243819908},null,null,{"$f":"VLOOKUP($A$4,Luvut!$B$3:$EJ$298,97)","v":84.447330372951342}]
["Rahoitusvarallisuus, euro/as",null,null,{"$f":"VLOOKUP($A$4,Luvut!$B$3:$AV$298,6)","v":-6016.3015777291039}," ",null,{"$f":"VLOOKUP($A$4,Luvut!$B$3:$EJ$298,52)","v":-6400.7277524402662},null,null,{"$f":"VLOOKUP($A$4,Luvut!$B$3:$EJ$298,98)","v":-6908.8508078017139}]
["Omavaraisuusaste, %",null,null,{"$f":"VLOOKUP($A$4,Luvut!$B$3:$AV$298,10)","v":43.38546407547495},null,null,{"$f":"VLOOKUP($A$4,Luvut!$B$3:$EJ$298,56)","v":42.443907732165421},null,null,{"$f":"VLOOKUP($A$4,Luvut!$B$3:$EJ$298,102)","v":41.859037258543488}]
{"$rows_left_out":65}
{"sheet":"Luvut","index":1,"n_rows":298,"n_cols":177,"rows_kept":298,"cut":false,"hidden":false,"merged":[]}
[null,null,2017,"hakee muualta",92,93,94,"vanha",96,97,98,99,100,101,102,103,104,null,105,106,107,108,"summana",110,111,112,113,114,115,116,null,117,118,119,120,121,122,"kaavasta",124,125,126,127,128,129,130,131,"kaavasta",133,2018,"hakee muualta",92,93,94,"vanha",96,97,98,99,100,101,102,103,104,null,105,106,107,108,"summana",110,111,112,113,114,115,116,117,null,118,119,120,121,122,"kaavasta",124,125,126,127,128,129,130,131,"kaavasta",133,2019,"hakee muualta",92,93,94,"vanha",96,97,98,99,100,101,102,107,108,109,110,111,112,113,"summana",115,116,117,118,119,120,121,122,123,124,125,126,127,128,"kaavasta",130,131,132,133,134,135,136,137,"kaavasta",139,"Erillistiedot",141,142,143,144,145,2017,147,148,2018,150,151,2019,153,154,2017,156,2018,158,2019,160,2017,162,163,164,2018,166,167,168,2019,170,171,172,2017,2018,2019,2019]
["Kunta nro","Kunta","Asukasluku ","Lainat e/asukas","Lainanhoitokate","Suhteellinen velkaantuneisuus-%","Rahoitusvarallisuus, e/as","Vuosikate","Suunnitelman mukaiset poistot","Tilikauden tulos","Omavaraisuusaste, %","Rahavarat e/as","Kassan riittävyys, pv","Kassasta maksut, €/as","Henkilöstökulut","Toimintatuotot","Toimintakulut","Osuus osakkuusyhteisojen voitosta/tappiosta","Toimintakate","Verotulot","Valtionosuudet","Alv-takaisinperintä","Käyttökate","Korkotuotot/-menot, netto","Muut rahoitustuotot/-menot, netto (sis Osinkotuotot)","Vuosikate","Suunnitelman mukaiset poistot ja arvonalet","Satu. erät, netto","Satunnaiset kulut","Tilikauden tulos","Vähemmistöosuudet","Tilinpäätössiirrot","Tilikauden verot","Lask. Verot","Tilikauden yli- tai alijäämä","Kumulat yli/alij","Tulorah (toiminnan rahavirta)","Investoinnit, netto","Saamisten muutos (ent Pitkäaikaisten saamisten muutokset, netto)","Pitkäaikaisten lainojen vähennys","Toim ja inv rahavirta","Verotulot","Kunnallisvero","Osuus yhteisöveron tuotosta","Kiinteistövero","Tuloveroprosentti 2015","Yhden veroprosentin tuotto 2015","Sijoitus vuosikatteen mukaan","Asukasluku ","Lainat e/asukas","Lainanhoitokate","Suhteellinen velkaantuneisuus-%","Rahoitusvarallisuus, e/as","Vuosikate","Suunnitelman mukaiset poistot","Tilikauden tulos","Omavaraisuusaste, %","Rahavarat e/as","Kassan riittävyys, pv","Kassasta maksut, €/as","Henkilöstökulut","Toimintatuotot","Toimintakulut","Osuus osakkuusyhteisojen voitosta/tappiosta","Toimintakate","Verotulot","Valtionosuudet","Alv-takaisinperintä","Käyttökate","Korkotuotot/-menot, netto","Muut rahoitustuotot/-menot, netto (sis Osinkotuotot)","Vuosikate","Suunnitelman mukaiset poistot ja arvonalet","Satu. erät",null,"Tilikauden tulos","Vähemmistöosuudet","Tilinpäätössiirrot","Tilikauden verot","Lask. verot","Tilikauden yli- tai alijäämä","Kumulat yli/alij","Toiminnan rahavirta","Investoinnit, netto","Saamisten muutos ","Pitkäaikaisten lainojen vähennys","Toim ja inv rahavirta","Verotulot","Kunnallisvero","Osuus yhteisöveron tuotosta","Kiinteistövero","Tuloveroprosentti 2016","Yhden veroprosentin tuotto 2016","Sijoitus vuosikatteen mukaan","Asukasluku","Lainat e/asukas","Lainanhoitokate","Suhteellinen velkaantuneisuus-%","Rahoitusvarallisuus, e/as","Vuosikate","Suunnitelman mukaiset poistot","Tilikauden tulos","Omavaraisuusaste, %","Rahavarat e/as","Kassan riittävyys, pv","Kassasta maksut, €/as","Henkilöstökulut","Toimintatuotot","Toimintakulut","Osuus osakkuusyhteisojen voitosta/tappiosta","Toimintakate","Verotulot","Valtionosuudet","Alv-takaisinperintä","Käyttökate","Korkotuotot/-menot, netto","Muut rahoitustuotot/-menot, netto (sis Osinkotuotot)","Vuosikate","Suunnitelman mukaiset poistot ja arvonalet","Satu. erät","Satu. kulut","Tilikauden tulos","Vähemmistöosuudet","Tilinpäätössiirrot","Tilikauden verot","Lask. verot","Tilikauden yli- tai alijäämä","Kumulat yli/alij","Toiminnan rahavirta","Investoinnit, netto","Saamisten muutos ","Pitkäaikaisten lainojen vähennys","Toim ja inv rahavirta","Verotulot","Takaukset muiden puolesta (jäljellä oleva pääoma)","Osuus yhteisöveron tuotosta","Kiinteistövero","Tuloveroprosentti 2017","Yhden veroprosentin tuotto 2006","Sijoitus vuosikatteen mukaan","Palvelujen ostot 2015","Palvelujen ostot 2016","Palvelujen ostot 2017","Harkvar2015","Harkvar2016","Harkvar2017"," - Investointimenot"," + Rahoitusos. investointimenoihin"," + Investointihyödykk. luovutustulot"," - Investointimenot"," + Rahoitusosuudet investointimenoihin"," + Investointihyödykkeiden luovutustulot"," - Investointimenot"," + Rahoitusosuudet investointimenoihin"," + Investointihyödykkeiden luovutustulot","Pitkäaikaisten lainojen lisäys"," ± Lyhytaikaisten lainojen muutos","Pitkäaikaisten lainojen lisäys"," ± Lyhytaikaisten lainojen muutos","Pitkäaikaisten lainojen lisäys"," ± Lyhytaikaisten lainojen muutos","Lainakanta","josta pitkäaik","josta lyhytaik","Lainasaamiset","Lainakanta","josta pitkäaik","josta lyhytaik","Lainasaamiset","Lainakanta","josta pitkäaik","josta lyhytaik","Lainasaamiset","Takaukset muiden puolesta (jäljellä oleva pääoma)","Takaukset muiden puolesta (jäljellä oleva pääoma)","Takaukset muiden puolesta (jäljellä oleva pääoma)","Vuokravastuut"]
[20,"Akaa",16769,null,1.1838147211500067,58.257712048256522,-4381.4777267577074,null,null,null,22.404665080948362,382.84930526566882,16.356744984713323,8543.2643568489475,null,58889,142923,96,-83938,59399,32904,null,null,-261,144,8248,7001,0,null,1247,-71,1,-84,-57,1036,-6683,7470,null,-839,-6867,1442,null,null,null,null,21.25,null,255,16611,null,0.69020213363279059,61.743501812088383,-4767.322858346879,null,null,null,18.920032976092333,387.03268918186745,14.023695691149227,10073.44530732647,null,61885,150217,9,-88323,59625,32456,null,null,-67,764,4455,7026,0,null,-2571,-87,2,-94,-35,-2785,-9933,4350,null,-1160,-6662,-4561,null,null,null,null,21.75,null,233,16475,null,1.3448478612376893,60.55128197194081,-4926.6767830045519,null,null,null,19.358001880125773,430.28831562974199,13.814818085482161,10310.166919575113,null,64620,153015,-4,-88399,62993,33974,null,null,-80,227,8715,8464,0,null,251,-102,0,70,-43,36,-9892,7916,null,-198,-6369,-1633,null,null,null,null,22.25,null,112,null,null,null,null,null,null,-7344,97,1219,-9405,130,364,-9837,35,253,1321,983,12126,-139,3804,4960,65864,49356,16508,7271,71138,54488,16650,7687,73531,52049,21482,7682,5140,6892,11897,12541]
[5,"Alajärvi",9831,null,1.7521731089328647,48.649492071052563,-4045.0615400264473,null,null,null,35.970768399702386,959.10894110466893,32.137614507559135,10892.991557318686,null,54164,112513,114,-58235,29659,37946,null,null,-346,83,9107,5188,0,null,3919,-102,9,-87,-16,3723,9052,8653,null,-1173,-5040,-817,null,null,null,null,21.75,null,89,9700,null,0.93271164746754431,52.878660950409831,-4758.0412371134025,null,null,null,33.057348584433676,914.63917525773195,24.198955305300444,13795.773195876289,null,56110,116873,190,-60573,28893,36755,null,null,-343,4,4736,5876,0,null,-1140,-5,25,-50,0,-1170,7456,4436,null,892,-5104,-6142,null,null,null,null,21.75,null,148,9562,null,0.78123254514987894,51.263742656040954,-5599.0378581886634,null,null,null,31.606193054146559,801.50596109600508,21.480130275874419,15766.262288224221,null,71516,133738,226,-61996,29512,36500,null,null,-377,164,3803,6114,0,null,-2311,7,-11,48,-5,-2368,4891,3486,null,338,-4978,-7070,null,null,null,null,21.75,null,162,null,null,null,null,null,null,-10966,647,849,-11309,579,152,-11425,781,88,6607,1439,7075,2000,9888,0,41635,33495,8140,17,45721,35494,10227,115,50397,39206,11191,0,1006,808,626,1338]
[9,"Alavieska",2610,null,1.5446559297218154,42.485539998103604,-3465.9003831417622,null,null,null,37.483545912577732,864.75095785440612,27.283731867258396,11568.582375478927,null,14579,30594,1,-16014,7282,9778,null,null,-45,9,1010,1059,0,null,-49,0,0,-1,-1,-51,300,1037,null,727,-638,142,null,null,null,null,21.5,null,276,2573,null,2.1007407407407408,40.653167057661442,-3263.8942868247182,null,null,null,38.78576602680188,1184.6094053633892,33.898656266187274,12755.149630781189,null,15045,30994,1,-15948,7525,9826,null,null,-29,15,1389,979,72,null,482,-1,-1,-1,1,480,926,1456,null,415,-646,554,null,null,null,null,21.5,null,127,2519,null,3.8731182795698924,40.471348247398012,-3265.1845970623262,null,null,null,40.241119483315394,1269.1544263596666,32.959649226758309,13399.76181024216,null,15791,31650,1,-15858,7960,9685,null,null,-27,14,1774,1068,0,null,706,0,0,1,0,705,1631,1775,null,-385,-438,146,null,null,null,null,22,null,56,null,null,null,null,null,null,-1100,201,4,-1137,234,1,-1628,18,-19,118,-2000,95,1499,323,1000,8306,4767,3539,102,9237,4309,4928,94,10120,1476,8644,57,1172,1543,1708,237]
[10,"Alavus",11713,null,1.447011952191235,58.449251892759762,-5011.6964057030646,null,null,null,38.531823506442798,1515.4102279518484,47.793900675735493,11573.123879450182,null,70759,136082,1545,-63778,35110,38629,null,null,-579,873,10255,6434,0,null,3821,-31,-4,-18,-30,3738,20120,8996,null,1315,-6889,1581,null,null,null,null,21.25,null,101,11544,null,0.3384476903563684,59.982757781593932,-5336.5384615384619,null,null,null,38.205106750895979,1512.6472626472628,37.079702135086393,14889.98613998614,null,71741,137803,1547,-64515,33798,38294,null,null,-519,610,7668,6649,0,null,1019,-4,9,-17,-68,939,20657,6355,null,1916,-23837,-2613,null,null,null,null,21.25,null,86,11468,null,0.98395149786019975,65.261180938228804,-5163.2368329264036,null,null,null,38.499838262623442,1616.7596791070807,39.883901559045157,13921.259155912103,null,72735,141054,562,-67757,34552,38072,null,null,-502,584,4949,7456,9142,null,6635,17,11,14,-71,6578,25846,4316,null,-8385,-5039,1385,null,null,null,null,21.25,null,153,null,null,null,null,null,null,-9360,768,1177,-9478,139,371,-13156,466,9759,8780,-1568,25419,-996,9250,3039,70327,61433,8894,2876,71092,64304,6788,2698,78561,67864,10697,1957,1190,1995,1494,1932]
[16,"Asikkala",8248,null,8.8795944233206594,39.584655642781584,-3093.3559650824441,null,null,null,46.135141109719257,557.8322017458778,20.979212732201528,9705.2618816682825,null,42592,82843,-3,-40254,29700,17513,null,null,-120,43,6882,4354,64,null,2592,0,0,-2,-43,2547,9751,6503,null,-158,-665,3943,null,null,null,null,20.75,null,115,8149,null,6.1349999999999998,38.468645982923107,-2786.845011657872,null,null,null,47.373709017301756,941.58792489876055,31.678637679847974,10848.938520063812,null,43453,84756,-6,-41309,28838,17538,null,null,-109,-163,4795,4165,263,null,893,0,0,-13,-59,821,10527,4897,null,1261,-687,2672,null,null,null,null,20.75,null,118,8083,null,3.4315286624203822,34.112320399208464,-2855.3754794012125,null,null,null,49.385642789631078,490.28825930966224,29.704665740377376,11664.357293084251,null,42608,88825,16,-46201,29745,20631,null,null,-93,124,4206,4111,-266,null,-171,-2,0,3,-28,-204,10323,3682,null,-503,-1152,-215,null,null,null,null,20.75,null,115,null,null,null,null,null,null,-3984,196,1228,-2610,106,279,-3980,3,80,326,-3250,82,-1150,12,-2530,24863,9426,15437,388,23108,8822,14286,344,19437,7683,11754,350,12,12,11,15887]
[18,"Askola",4990,null,1.4330708661417322,71.397621684078757,-5016.0320641282569,null,null,null,16.120002870882079,511.0220440881763,25.017471239651648,7455.7114228456921,null,15461,39934,-30,-24503,18756,7325,null,null,-172,242,1648,2120,0,null,-472,0,123,-3,0,-352,-2503,1460,null,-373,-1098,-2271,null,null,null,null,20.75,null,282,4958,null,0.55878712871287128,80.769047278278705,-5369.9072206534893,null,null,null,16.294861424496574,1060.9116579265833,40.30355193551096,9607.9064138765625,null,14418,41260,-2,-26844,18547,8957,null,null,-216,243,687,2089,2228,null,826,0,178,-6,0,998,-1633,2718,null,201,-1400,-1523,null,null,null,null,20.75,null,265,4943,null,1.7619047619047619,84.320400974064356,-5149.0997370018213,null,null,null,21.089637758570458,1390.4511430305481,41.543688059895267,9349.3829658102368,null,14287,39474,3,-25184,19707,8303,null,null,-274,281,2833,2340,2496,null,2989,-2,7,1,0,2993,1595,5184,null,-1599,-1489,835,null,null,null,null,21.5,null,100,null,null,null,null,null,null,-4053,12,310,-4701,21,439,-4914,308,257,2257,1738,7045,-1916,5527,-1757,24594,16477,8117,0,28168,21682,6486,0,29815,25380,4435,0,2000,2000,2000,345]
[19,"Aura",3991,null,2.9554247266610596,55.610570900196862,-3685.0413430217991,null,null,null,25.320338588180476,588.32372838887488,28.450685522690303,7547.7323978952645,null,12669,30038,1,-17368,14873,5984,null,null,-62,22,3449,1306,0,null,2143,-24,0,0,0,2119,1556,3453,null,-224,-1124,2452,null,null,null,null,21.75,null,103,3984,null,1.2023622047244094,56.550585501574588,-3912.9016064257025,null,null,null,25.069680424573328,261.29518072289153,10.90787736119883,8743.4738955823304,null,12003,31204,1,-19200,14314,6390,null,null,-52,23,1475,1297,0,null,178,-41,-81,0,-21,35,1642,1562,null,-278,-1218,-850,null,null,null,null,21.75,null,189,3941,null,1.3693239152371341,58.695847698995649,-3963.9685359045925,null,null,null,25.486531061022539,507.99289520426282,11.029462989840347,8741.4361837097185,null,12253,32020,7,-19760,14707,6395,null,null,-50,15,1307,1309,-1,null,-3,-46,-107,0,-26,-182,1610,1331,null,-87,-941,121,null,null,null,null,21.75,null,197,null,null,null,null,null,null,-1111,10,100,-2336,16,-92,-1414,26,178,197,-593,225,464,5095,-2855,14775,4567,10208,0,14251,3750,10501,0,15560,7404,8156,0,912,1020,657,1286]
[46,"Enonkoski",1416,null,9.0487804878048781,17.954251186879585,960.45197740112997,null,null,null,75.029689355584722,2175.8474576271187,60.895922456273354,13041.666666666666,null,10316,19838,0,-9522,4854,5683,null,null,-4,71,1082,787,-16,null,279,0,0,0,-36,243,6840,1036,null,-876,-92,-56,null,null,null,null,21,null,151,1405,null,7.7179487179487181,18.698988319241483,748.75444839857653,null,null,null,74.059745037102815,2365.8362989323846,57.851420942208662,14926.690391459075,null,10151,19928,0,-9777,4481,5829,null,null,-7,62,588,843,5,null,-250,0,1,-1,-8,-258,6659,577,null,469,-64,-225,null,null,null,null,21,null,174,1361,null,15.931506849315069,15.756728079482976,1111.6825863335782,null,null,null,77.53552657192914,2612.0499632623073,59.331018631717932,15024.981631153563,null,10276,19669,0,-9393,4713,5745,null,null,-6,94,1153,877,0,null,276,0,0,0,-4,272,6931,1104,null,328,-63,438,null,null,null,null,21,null,33,null,null,null,null,null,null,-1552,18,442,-907,94,11,-702,12,24,14,0,9,52,16,-231,1085,930,155,0,1082,787,295,0,804,648,156,0,109,108,108,449]
[47,"Enontekiö",1893,null,1.8922413793103448,81.736962393517558,-6499.7358689910197,null,null,null,36.441123460498645,1033.2805071315372,44.947116595316047,8390.9138932910719,null,4225,17496,2,-13269,6203,8824,null,null,-157,421,2022,1177,-22,null,823,0,-11,0,-3,809,1400,1995,null,996,-987,1231,null,null,null,null,21.25,null,59,1852,null,1.4804177545691906,65.110792821636196,-6109.6112311015122,null,null,null,38.778688220681474,1225.7019438444925,33.211079044412379,13470.842332613391,null,8772,22485,-11,-13724,6362,8604,null,null,-121,443,1564,1111,0,null,453,0,10,-23,-1,439,1933,1596,null,723,-1012,852,null,null,null,null,21.25,null,41,1838,null,1.1656746031746033,64.784320365745245,-6209.4668117519041,null,null,null,39.994780209537304,1076.1697497279652,31.210682939691871,14443.416757344939,null,8571,22860,-7,-14296,6263,8789,null,null,-77,401,1080,1024,0,null,56,0,1,30,-4,23,2110,1087,null,231,-913,-584,null,null,null,null,21.25,null,91,null,null,null,null,null,null,-2967,2153,50,-1018,87,187,-2409,492,246,0,-342,0,48,261,787,10397,8767,1630,116,9399,7721,1678,136,9071,6633,2438,35,5138,1161,324,323]
[49,"Espoo",279044,null,1.9841792278827195,147.25046516140154,-9164.6765384670525,null,null,null,40.764271864450905,3871.3822909648657,214.29947461071356,6593.8310804030898,null,1012445,2264850,994,-1251411,1490270,84559,null,null,-43228,39111,319301,267979,1200,null,52522,-463,17,-390,-773,50913,600201,289704,null,22161,-133610,-231776,null,null,null,null,18,null,44,283632,null,1.7712961263080595,143.48878060487368,-9498.6849156653698,null,null,null,40.414220850683257,3541.0320415185874,118.50017277812024,10906.960427596323,null,1102801,2383893,-1616,-1282708,1501986,95314,null,null,-35590,20923,299925,306013,0,null,-6088,3973,12237,-622,2802,12302,604643,229225,null,-1956,-148680,-151086,null,null,null,null,18,null,19,289731,null,1.632158999442759,149.83547467507452,-10314.115507142831,null,null,null,38.123464684348875,3381.260548577819,107.7189557905575,11746.0230351602,null,1171298,2544378,-1283,-1374363,1521184,113469,null,null,-34689,44470,270071,323458,0,null,-53387,3766,15025,603,2899,-32300,551120,183927,null,-59706,-147551,-324600,null,null,null,null,18,null,25,null,null,null,null,null,null,-616503,48410,46613,-495489,36891,78287,-661148,58030,94591,374787,1824,219699,1933,449241,-1583,3429679,3275274,154405,208539,3502631,3329807,172824,208048,3802739,3607234,195505,205140,50979,92306,94817,602654]
[50,"Eura",11910,null,1.8194477224451262,65.168098251254776,-4830.3106633081443,null,null,null,35.010461111161867,448.95046179680941,20.097363814231286,8153.6523929471032,null,36426,99266,0,-62840,44397,26168,null,null,-466,-3,7256,5748,0,null,1508,30,0,0,-4,1534,5504,6875,null,-463,-3784,1115,null,null,null,null,20.5,null,219,11748,null,0.47165354330708659,70.15753209251794,-5271.7909431392573,null,null,null,31.1763410067188,486.38066053796393,18.378980947848923,9659.346271705821,null,36008,103147,0,-67139,43565,25358,null,null,-377,9,1416,5804,0,null,-4388,36,0,0,38,-4314,1114,1138,null,877,-3429,-4519,null,null,null,null,20.5,null,272,11632,null,0.55009052504526257,76.194462209849135,-6003.610729023384,null,null,null,26.790557778553588,429.16093535075657,17.723927527364197,10116.231086657497,null,36328,104526,0,-68198,43287,26709,null,null,-340,22,1480,6065,3,null,-4582,10,0,2,26,-4548,-3389,1283,null,-216,-2971,-8008,null,null,null,null,20.5,null,253,null,null,null,null,null,null,-6603,191,652,-6341,81,603,-9684,41,352,334,1632,933,4000,5648,6000,52506,35316,17190,50,54266,33394,20872,50,63193,36129,27064,50,552,607,424,1865]
[51,"Eurajoki",9521,null,5.9514884233737595,33.448408530815541,-191.15639113538492,null,null,null,74.539344161437185,2540.8045373385153,108.93889108226817,8512.9713265413302,null,30898,86250,0,-55352,51919,13352,null,null,-92,836,10663,5641,-2,null,5024,0,29,-3,-13,5037,76253,10769,null,-365,-1681,3378,null,null,null,null,18,null,47,9454,null,2.9886304909560724,33.19823769702932,15.337423312883436,null,null,null,75.003105493618207,2765.1787603130947,99.312336722905101,10162.78823778295,null,31437,87039,0,-55602,50340,11737,null,null,-129,-693,5653,5919,0,null,-266,1,-52,0,-7,-324,75926,5702,null,1108,-1805,1863,null,null,null,null,18,null,113,9402,null,2.7975016436554898,30.76287235934835,-38.608806636885767,null,null,null,75.731238509109147,2591.6826207189956,95.438342051830887,10633.801318868325,null,32393,93103,0,-60710,52060,11120,null,null,-49,1785,4206,5684,0,null,-1478,0,-49,13,-14,-1554,74437,4127,null,385,-1472,-654,null,null,null,null,18,null,143,null,null,null,null,null,null,-7916,39,486,-5328,16,1473,-4977,48,148,568,-763,660,-379,402,-448,17545,15617,1928,130,16111,14279,1832,62,14768,12838,1930,105,111,47,0,201]
[52,"Evijärvi",2499,null,2.2268431001890359,38.61535243672872,-228.09123649459784,null,null,null,54.727410511300313,3002.8011204481791,119.83549177458872,9146.058423369348,null,7148,23269,0,-16121,8224,8533,null,null,72,448,1156,888,0,null,268,-7,-28,-8,-2,223,3481,1104,null,-121,-507,339,null,null,null,null,21.5,null,264,2473,null,-0.42926829268292682,42.641199424933248,-877.88111605337645,null,null,null,49.380515197432928,2844.3186413263243,97.553385515616696,10642.135058633239,null,7570,24216,4,-16642,7975,8800,null,null,21,-270,-116,940,0,null,-1056,-2,-25,-2,-1,-1086,2289,-188,null,41,-177,-1554,null,null,null,null,21.5,null,286,2425,null,2.4423076923076925,52.372211803200194,-1726.1855670103093,null,null,null,43.984696635754979,3125.7731958762888,92.290426676228037,11501.030927835052,null,7743,25616,1,-17872,8046,9272,null,null,24,624,94,1115,0,null,-1021,4,-12,2,2,-1029,1214,79,null,-100,-19,-1866,null,null,null,null,21.5,null,271,null,null,null,null,null,null,-976,52,159,-1537,75,96,-2124,160,19,618,950,538,550,299,1000,7285,2021,5264,56,8210,2398,5812,54,9505,2530,6975,52,21,11,4,357]
{"$rows_left_out":283}