{"text_format":"1","workbook":"xlsx","n_sheets":2,"sheets":["Kuntakortti","Luvut"],"not_rendered":{"charts":0,"images":0,"macros":1,"external_links":0,"defined_names":2,"comments":0,"pivot_tables":0},"unopened":[],"bounds":{"document_bytes":16777216,"sheet_cells":100000,"rows_first":2000,"rows_last":500,"rows_between":2000,"halvings":0,"cell_chars":16384,"cell_head_chars":4096},"cells_cut":0,"cells_raw":0,"read":"whole","date_system":"1900"}

{"sheet":"Kuntakortti","index":0,"n_rows":79,"n_cols":22,"rows_kept":79,"cut":false,"hidden":false,"merged":[[1,6,1,7]]}
["Valtiovarainministeriö/Kunta- ja aluehallinto-osasto, 6.2.2020"]
["KUNTIEN LOPULLISET TP:T 2017-2018 ja Tpa 2019 ",null,null,null,null,null,"Valitse kunta valikosta:"]
[null,null,null,null,null,null,null," "]
[{"$f":"INDEX(Luvut!$B$3:'Luvut'!$B$298,$A$7)","v":"KOKO MAA (Manner-Suomi)"},null,null,2017,null,null,2018,null,null,2019]
[]
["Asukasluku",null,null,{"$f":"VLOOKUP($A$4,Luvut!$B$3:$AT$298,2)","v":5483641},null,null,{"$f":"VLOOKUP($A$4,Luvut!$B$3:$ED$298,46)","v":5488130}," ",{"$f":"((G6/D6)-1)*100","v":8.1861668187244163E-2},{"$f":"VLOOKUP($A$4,Luvut!$B$3:$ED$298,90)","v":5495408}," ",{"$f":"((J6/G6)-1)*100","v":0.13261347672157697},null,null,null,null,null,"Kunta"]
[96,null,null," ",null,null,null,null,null,null,null,null,null,null,null,null,null,null,2017,2018,"2019a"]
["Tunnuslukuja",null,null," ",null,null,null,null,null,null,null,null,null,null,null,null,null,"Vuosikate",{"$f":"D36","v":3266069},{"$f":"G36","v":2065203},{"$f":"J36","v":1747616}]
[null,null,null," "," "," "," ",null,"muut.%"," ",null,"muut.%",null,"Konsernivelka, €","Konsernivelka, €","Konsernivelka, €",null,"Poistot",{"$f":"D38","v":2195625},{"$f":"G38","v":2192453},{"$f":"J38","v":2305725}]
["Lainat, euro/as",null,null,{"$f":"E67","v":2940.6757298663424}," ",null,{"$f":"H67","v":3048.3937151634527},null,{"$f":"((G10/D10)-1)*100","v":3.6630351385940285},{"$f":"K67","v":3351.8961649435309},null,{"$f":"((J10/G10)-1)*100","v":9.9561434033400342},null,2017,2018,2019,null,"Tilikauden tulos",{"$f":"D41","v":1193203},{"$f":"G41","v":-107421},{"$f":"J41","v":-164092}]
["Konsernilainat, euro/as",null,null,{"$f":"VLOOKUP($A$4,Luvut!$B$3:$FM$298,167)","v":6314.2279007688503},null,null,{"$f":"VLOOKUP($A$4,Luvut!$B$3:$FM$298,168)","v":6557.6436782656392},null,{"$f":"((G11/D11)-1)*100","v":3.8550362977419539},{"$f":"VLOOKUP($A$4,Luvut!$B$3:$FN$298,169)","v":7105.3242998518035},null,{"$f":"((J11/G11)-1)*100","v":8.3517898875989935},null,{"$f":"D11*D6","v":34624959000},{"$f":"G11*G6","v":35989201000},{"$f":"J11*J6","v":39046656000},null,"Taseen kertynyt ali-/ylijäämä",{"$f":"D47","v":11311167},{"$f":"G47","v":11261407},{"$f":"J47","v":11087957}]
["Lainanhoitokate",null,null,{"$f":"VLOOKUP($A$4,Luvut!$B$3:$AT$298,4)","v":1.84}," ",null,{"$f":"VLOOKUP($A$4,Luvut!$B$3:$ED$298,48)","v":1.1218667063571479},null,null,{"$f":"VLOOKUP($A$4,Luvut!$B$3:$ED$298,92)","v":0.7093755419490988},null,null,null,null,null,null,null,"Toiminnan ja investointien rahavirta",{"$f":"D60","v":465219},{"$f":"G60","v":-1214884},{"$f":"J60","v":-1434149},"(2019 ei vielä lukuja)"]
["Suhteellinen velkaantuneisuus, %",null,null,{"$f":"VLOOKUP($A$4,Luvut!$B$3:$AT$298,5)","v":56.230046087942604}," ",null,{"$f":"VLOOKUP($A$4,Luvut!$B$3:$ED$298,49)","v":58.68132053012561},null,null,{"$f":"VLOOKUP($A$4,Luvut!$B$3:$ED$298,93)","v":62.067154779893912},null,null,null,null,null,null,null,"Lainakanta",{"$f":"D67","v":16125610},{"$f":"G67","v":16729981},{"$f":"J67","v":18420037}]
["Rahoitusvarallisuus, euro/as",null,null,{"$f":"VLOOKUP($A$4,Luvut!$B$3:$AT$298,6)","v":-2554.7153797996621}," ",null,{"$f":"VLOOKUP($A$4,Luvut!$B$3:$ED$298,50)","v":-2782.6265048386244},null,null,{"$f":"VLOOKUP($A$4,Luvut!$B$3:$ED$298,94)","v":-3029.5543115270057},null,null,null,null,null,null,null,"Lainanhoitokate",{"$f":"D12","v":1.84},{"$f":"G12","v":1.1218667063571479},{"$f":"J12","v":0.7093755419490988},"(2019 ei vielä lukuja)"]
["Omavaraisuusaste, %",null,null,{"$f":"VLOOKUP($A$4,Luvut!$B$3:$AT$298,10)","v":60.7},null,null,{"$f":"VLOOKUP($A$4,Luvut!$B$3:$ED$298,54)","v":59.513878587260145},null,null,{"$f":"VLOOKUP($A$4,Luvut!$B$3:$ED$298,98)","v":57.827627708032679},null,null,null,null,null,null,null,"Veroprosentti",{"$f":"D72","v":19.920000000000002},{"$f":"G72","v":19.87},{"$f":"J72","v":19.899999999999999}]
{"$rows_left_out":65}
{"sheet":"Luvut","index":1,"n_rows":298,"n_cols":179,"rows_kept":298,"cut":false,"hidden":false,"merged":[]}
[null,null,2017,"hakee muualta",92,93,94,95,96,97,98,99,100,101,102,103,104,105,106,107,108,null,110,111,112,113,114,115,116,117,118,119,120,121,122,null,124,125,126,127,128,129,130,131,132,133,2018,null,92,93,94,95,96,97,98,99,100,101,102,103,104,105,106,107,108,109,110,111,112,113,114,115,116,117,118,119,120,121,122,123,124,125,126,127,128,129,130,131,132,133,2019,null,92,93,94,95,96,97,98,99,100,101,102,103,104,105,106,107,108,"summana",110,111,112,113,114,115,116,117,118,119,120,121,122,123,124,125,126,127,128,129,130,131,132,133,"Erillistiedot",135,136,137,138,139,2017,144,145,2018,147,148,2019,147,148,2017,152,2018,154,2019,null,2017,160,161,162,2018,164,165,166,2019,164,165,166,2017,2018,2019,"Yhden vero%:n","Yhden vero%:n"]
["Kunta nro","Kunta","Asukasluku ","Lainat e/asukas","Lainanhoitokate","Suhteellinen velkaantuneisuus-%","Rahoitusvarallisuus, e/as",null,null,null,"Omavaraisuusaste, %","Rahavarat e/as","Kassan riittävyys, pv","Kassasta maksut, €/as","Henkilöstökulut","Toimintatuotot","Toimintakulut","Toimintakate","Verotulot","Valtionosuudet","Alv-takaisinperintä",null,"Korkotuotot/-menot, netto","Muut rahoitustuotot/-menot, netto (sis Osinkotuotot)","Vuosikate","Suunnitelman mukaiset poistot ja arvonalet","Satunnaiset tuotot","Satunnaiset kulut","Tilikauden tulos","Poistoeron lisäys(-) tai vähennys(+)","Varausten lisäys(-) tai vähennys(+)","Rahastojen lisäys(-) tai vähennys(+)","Tilikauden yli- tai alijäämä","Kumulat yli/alij","Tulorah (toiminnan rahavirta)",null,"Saamisten muutos ","Pitkäaikaisten lainojen vähennys","Toim ja inv rahavirta","Verotulot","Kunnallisvero","Osuus yhteisöveron tuotosta","Kiinteistövero","Tuloveroprosentti",null,"Sijoitus vuosikatteen mukaan","Asukasluku ",null,"Lainanhoitokate","Suht. velkaantuneisuus-%","Rahoitusvarallisuus, e/as",null,null,null,"Omavaraisuusaste, %","Rahavarat e/as","Kassan riittävyys, pv","Kassasta maksut, €/as","Henkilöstökulut","Toimintatuotot","Toimintakulut","Toimintakate","Verotulot","Valtionosuudet",null,null,"Korkotuotot/-menot, netto","Muut rahoitustuotot/-menot, netto (sis Osinkotuotot)","Vuosikate","Suunnitelman mukaiset poistot ja arvonalet","Satu. tuotot","Satu. kulut","Tilikauden tulos","Poistoeron lisäys(-) tai vähennys(+)","Varausten lisäys(-) tai vähennys(+)","Rahastojen lisäys(-) tai vähennys(+)","Tilikauden yli- tai alijäämä","Kumulat yli/alij","Tulorah (toiminnan rahavirta)",null,"Saamisten muutos ","Pitkäaikaisten lainojen vähennys","Toim ja inv rahavirta","Verotulot","Kunnallisvero","Osuus yhteisöveron tuotosta","Kiinteistövero","Tuloveroprosentti ",null,"Sijoitus vuosikatteen mukaan","Asukasluku",null,"Lainanhoitokate","Suht. velkaantuneisuus-%","Rahoitusvarallisuus, e/as",null,null,null,"Omavaraisuusaste, %","Rahavarat e/as","Kassan riittävyys, pv","Kassasta maksut, €/as","Henkilöstökulut","Toimintatuotot","Toimintakulut","Toimintakate","Verotulot","Valtionosuudet","Alv-takaisinperintä","Käyttökate","Korkotuotot/-menot, netto","Muut rahoitustuotot/-menot, netto (sis Osinkotuotot)","Vuosikate","Suunnitelman mukaiset poistot ja arvonalet","Satu. tuotot","Satu. kulut","Tilikauden tulos","Poistoeron lisäys(-) tai vähennys(+)","Varausten lisäys(-) tai vähennys(+)","Rahastojen lisäys(-) tai vähennys(+)","Tilikauden yli- tai alijäämä","Kumulat yli/alij","Toiminnan rahavirta",null,"Saamisten muutos ","Pitkäaikaisten lainojen vähennys","Toim ja inv rahavirta","Verotulot","Kunnallisvero","Osuus yhteisöveron tuotosta","Kiinteistövero","Tuloveroprosentti ",null,"Sijoitus vuosikatteen mukaan","Palvelujen ostot 2017","Palvelujen ostot 2018","Palvelujen ostot 2019","Harkvar2017","Harkvar2018","Harkvar2019"," - Investointimenot"," + Rahoitusos. investointimenoihin"," + Investointihyödykk. luovutustulot"," - Investointimenot"," + Rahoitusosuudet investointimenoihin"," + Investointihyödykkeiden luovutustulot"," - Investointimenot"," + Rahoitusosuudet investointimenoihin"," + Investointihyödykkeiden luovutustulot","Pitkäaikaisten lainojen lisäys"," ± Lyhytaikaisten lainojen muutos","Pitkäaikaisten lainojen lisäys"," ± Lyhytaikaisten lainojen muutos","Pitkäaikaisten lainojen lisäys"," ± Lyhytaikaisten lainojen muutos","Lainakanta","josta pitkäaik","josta lyhytaik","Lainasaamiset","Lainakanta","josta pitkäaik","josta lyhytaik","Lainasaamiset","Lainakanta","josta pitkäaik","josta lyhytaik","Lainasaamiset","Konsernilainat €/as","Konsernilainat €/as","Konsernilainat €/as","tuotto","tuotto, €/as"]
[20,"Akaa",16769,null,1.0088908981314044,59.665482401582203,-3534.3192796231142,null,null,null,28.187524729182037,209.43407478084561,11.160854991075704,6849.2456318206214,null,21856,106289,-84433,59399,30488,null,null,-111,865,6208,4695,0,0,1513,28,0,0,1541,-6564,5413,null,-310,-6149,4429,59399,54017,1893,3489,21.25,null,213,16611,null,0.40412044374009509,62.298129324180955,-3676.9008488351092,null,null,null,25.829980420423006,248.63042562157605,12.614538790470373,7194.0882547709352,44053,20752,108994,-88242,59625,29905,null,null,62,878,2228,4577,0,0,-2349,27,0,0,-2322,-8886,1932,null,398,-5988,-1357,59625,54693,1613,3319,21.75,null,206,16475,null,0.80323175774540367,59.075532601678503,-3668.7101669195749,null,null,null,25.899652860130661,178.69499241274659,8.8358974780656681,7381.6691957511384,44817,21733,110542,-88791,62993,31449,null,null,85,321,6057,6043,0,0,14,26,0,0,40,-8846,5908,null,-1750,-5507,778,{"$f":"DC3","v":62993},57840,1596,3557,22.25,null,66,47917,50584,49394,null,null,1000,-1929,95,850,-3773,130,354,-5323,34,159,0,987,7500,-56,0,5020,52640,36938,15702,7219,54097,38470,15627,7639,53609,33398,20211,7639,3927.7237760152661,4285.7142857142853,4463.186646433991,{"$f":"(DY3/EB3)","v":2599.5505617977528},{"$f":"(FO3/CM3)*1000","v":157.78759100441596},null,null,null,null,null,4670,{"$f":"FV3*-1","v":-4670}]
[5,"Alajärvi",9831,null,1.8237333333333334,34.971089100538052,-2238.9380530973453,null,null,null,50.971619072685002,440.54521411860441,15.815583324162358,10167.12440240057,40714,29143,87940,-58797,29659,35799,null,null,-193,158,6626,3001,0,0,3625,0,0,0,3625,8644,6523,null,-1698,-3537,-916,29659,25065,2438,2156,21.75,null,61,9700,null,0.76709401709401714,39.342238065582926,-2770.9278350515465,null,null,null,47.735358222597199,405.56701030927832,14.024476002578478,10555.257731958764,41606,29186,90428,-61242,28893,35055,null,null,-193,147,2660,3573,0,0,-913,0,0,0,-913,7731,2602,null,911,-3532,-4891,28893,24613,2142,2138,21.75,null,123,9562,null,0.34200108228190595,38.199113867153457,-3405.7728508680193,null,null,null,43.140005395198273,352.54130934950842,10.292828401970873,12501.673290106672,45948,44709,107678,-62969,29512,34792,null,null,-202,150,1283,3246,0,0,-1963,0,0,0,-1963,5768,1301,null,125,-3838,-5586,{"$f":"DC4","v":29512},25292,2066,2154,21.75,null,162,36649,38046,49572,null,null,null,-8254,647,168,-8209,576,140,-7703,779,37,4000,2000,4000,2000,8070,0,21157,15626,5531,458,23626,15945,7681,451,27858,19714,8144,543,4235.0727291221638,4713.5051546391751,5270.5500941225682,1162.8505747126437,121.6116476378,null,null,null,null,null,3040,-3040]
[9,"Alavieska",2610,null,1.1881804043545878,60.200468486136081,-3405.7471264367819,null,null,null,39.527266772203724,345.21072796934868,17.207251988279616,7322.605363984675,4205,2156,17600,-15444,7284,8917,null,null,-43,7,721,817,0,0,-96,0,0,0,-96,-290,721,null,629,-600,51,7284,6494,285,505,21.5,null,256,2573,null,2.1957773512476009,57.307815674115254,-3238.6319471434126,null,null,null,41.54699738903394,672.75553828216096,33.43998094633217,7343.1791682860476,4254,2153,17572,-15419,7528,9025,null,null,-28,10,1116,719,0,0,397,0,0,0,397,107,1028,null,605,-493,553,7528,6537,259,732,21.5,null,63,2519,null,1.1490431084477093,56.665442526625043,-3183.0091306073837,null,null,null,43.548975655528331,720.12703453751487,34.645492124954217,7586.7407701468837,4470,2190,17586,-15396,7962,8909,null,null,-26,11,1460,745,0,0,715,0,0,0,715,823,1460,null,-313,-344,324,7962,6931,263,768,22,null,17,11750,11724,11440,null,null,null,-859,189,0,-796,144,177,-1151,0,15,0,-2000,0,1500,0,1000,7801,4308,3493,84,8807,3963,4844,84,9463,833,8630,84,3182.3754789272034,3589.9727944034203,4017.4672489082964,315.04545454545456,125.06766754484103,null,null,null,null,null,792,-792]
[10,"Alavus",11713,null,0.95463642428285522,53.389356395253969,-2373.9434816016392,null,null,null,51.307326915801418,1244.8561427473746,57.187150777959253,7945.3598565696229,23076,12152,81802,-69650,35218,38629,null,null,-66,1332,5463,3217,0,0,2246,0,0,0,2246,15165,5428,null,338,-5735,1987,35218,29789,2699,2730,21.25,null,167,11544,null,0.13954724671067203,55.822813533816628,-2585.4989604989605,null,null,null,50.604927178887102,1225.8316008316008,46.872924115650576,9545.5647955647946,23328,11762,82024,-70262,33901,38294,null,null,-32,999,2900,3286,0,0,-386,0,0,0,-386,14779,2686,null,694,-22323,-2411,33901,28747,2398,2756,21.25,null,138,11468,null,0.2171916408731363,63.285908259047169,-2337.2863620509243,null,null,null,50.387057174528429,1263.1670735960934,54.930497839095743,8393.442622950819,24125,11960,84410,-72208,34663,38072,null,null,-71,620,1076,3653,9142,0,6565,0,0,0,6565,21344,886,null,-9544,-3177,1926,34663,29279,2585,2799,21.25,null,183,51412,51990,53095,null,null,null,-4099,258,400,-5594,131,366,-8782,156,9666,6760,-1000,23000,-1000,8000,2000,38742,32437,6305,8634,38419,34242,4177,8286,45243,38265,6978,7374,6004.1833859813887,6158.3506583506578,6850.4534356470176,1377.835294117647,120.14608424465007,null,null,null,null,null,2706,-2706]
[16,"Asikkala",8248,null,70.661764705882348,28.39358480690867,-1464.8399612027158,null,null,null,70.567186905215081,120.51406401551891,7.0218119181714371,6264.4277400581959,13221,6285,48775,-42490,29701,17513,null,null,-41,80,4763,2353,0,0,2410,94,-2400,0,104,10152,4310,null,1152,-26,2623,29701,25298,1616,2787,20.75,null,95,8149,null,48.338709677419352,27.159977173292752,-1227.2671493434777,null,null,null,72.149432751441992,359.30789053871644,20.990277914170676,6248.0058902932869,13175,6194,49448,-43254,28838,17538,null,null,-41,-126,2955,2255,0,0,700,94,0,0,794,10946,2847,null,765,-20,1928,28838,24509,1436,2893,20.75,null,90,8083,null,2.1669106881405562,21.974680745204267,-1233.9477916615119,null,null,null,75.357891584306685,123.22157614746999,6.7047822799284411,6708.0291970802919,13729,6112,52010,-45898,29745,18410,null,null,-40,147,2364,2215,0,182,-33,94,0,0,61,11007,2079,null,396,-15,145,29745,25296,1538,2911,20.75,null,90,31830,32499,34689,null,null,null,-2633,190,756,-1179,95,165,-2006,0,72,0,-3000,0,-1500,0,-3000,11990,1469,10521,807,10470,1455,9015,810,7455,1445,6010,810,3014.4277400581959,2835.6853601668918,2404.6764815043916,1219.0843373493976,150.82077661133215,null,null,null,null,null,380,-380]
[18,"Askola",4990,null,0.93658536585365859,74.174605245987209,-3914.4288577154307,null,null,null,22.13725544919204,345.49098196392788,18.3302746948644,6879.5591182364724,12945,4571,29968,-25397,18756,7325,null,null,-131,276,829,1338,0,0,-509,0,0,0,-509,-1309,644,null,-300,-894,-2389,18756,16579,1038,1139,20.75,null,279,4958,null,-1.3781223083548665E-2,81.339901477832512,-3928.8019362646228,null,null,null,22.155937127146341,793.66680112948768,42.155352058935748,6871.9241629689386,13618,4412,30745,-26333,18547,7491,null,null,-182,279,-198,1255,2228,0,775,0,0,0,775,-699,1965,null,125,-979,189,18547,16454,949,1144,20.75,null,264,4943,null,0.73018462222881297,84.090208885328735,-3763.3016386809632,null,null,null,27.030898301616535,1226.1784341493021,61.518450543644505,7275.1365567469147,13781,4448,30316,-25868,19707,8303,null,null,-231,319,2230,1274,2496,0,3452,0,0,0,3452,2648,4638,null,-1278,-1238,1046,19707,17550,957,1200,21.5,null,43,13213,13333,12858,null,null,680,-3320,6,281,-2145,13,356,-4153,308,253,2000,1751,5000,-2243,5000,-2000,19431,11811,7620,0,21209,15576,5633,0,22972,18999,3973,0,4928.6573146292585,5681.3231141589349,6031.7620878009302,816.27906976744191,165.13839161793283,null,null,null,null,null,699,-699]
[19,"Aura",3991,null,3.8417462482946796,58.264376897168283,-2959.4086695063893,null,null,null,27.226140341975746,361.81408168378852,23.191938748569921,5694.312202455525,6178,3192,21251,-18059,14873,5984,null,null,-19,18,2797,752,0,0,2045,28,0,0,2073,136,2830,null,-185,-714,2215,14873,13597,745,531,21.75,null,51,3984,null,1.1440329218106995,60.236665796571828,-3204.5682730923695,null,null,null,27.083119284907017,26.857429718875501,1.5820067241868192,6196.5361445783128,6172,2672,22180,-19508,14314,6000,null,null,-15,28,819,804,0,0,15,28,0,0,43,179,643,null,-215,-714,-977,14314,12992,571,751,21.75,null,163,3941,null,0.35407786302926969,64.10344237026888,-3314.6409540725704,null,null,null,24.504793887185478,248.92159350418675,14.539529784382994,6248.9215935041866,6514,2647,22749,-20102,14707,6002,null,null,-13,16,610,847,0,0,-237,28,0,0,-209,-30,747,null,44,-714,-317,14707,13353,603,751,21.75,null,153,12654,12947,12935,null,null,null,-739,0,124,-1759,0,139,-1132,22,46,0,-590,0,200,5000,-2700,11976,2262,9714,0,11462,1548,9914,0,13047,5333,7714,0,3702.0796792783767,3577.0582329317267,3948.2364882009642,613.93103448275861,155.78052131001232,null,null,null,null,null,607,-607]
[46,"Enonkoski",1416,null,{"$error":"#DIV/0!"},10.119047619047619,1542.3728813559323,null,null,null,90.500975927130767,1900.4237288135594,79.854878048780492,8686.4406779661022,2388,1299,10844,-9545,4853,5272,null,null,26,40,646,513,294,50,377,0,0,0,377,6119,597,null,-367,0,-156,4853,3723,595,535,21,null,174,1405,null,{"$error":"#DIV/0!"},13.286775897573641,1288.9679715302491,null,null,null,87.912354463130654,1987.9003558718862,86.864775051124738,8353.0249110320274,2372,1385,10931,-9546,4481,5335,null,null,17,52,339,595,0,0,-256,0,0,1,-255,5864,339,null,147,0,-357,4481,3379,569,533,21,null,143,1361,null,7.6088474970896387,10.682596854959149,1544.4526083761939,null,null,null,89.985320502365028,2108.0088170462896,93.265496971856081,8249.8163115356347,2446,1423,10689,-9244,4713,5247,null,null,12,89,817,655,0,0,162,0,0,0,162,6025,817,null,54,0,267,4713,3580,597,536,21,null,15,7520,7560,7318,null,null,null,-1453,3,697,-780,80,4,-558,0,8,0,0,0,0,0,0,0,0,0,346,0,0,0,286,0,0,0,261,766.24293785310738,770.10676156583634,590.74210139603235,170.47619047619048,125.25803855708337,null,null,null,null,null,63,-63]
[47,"Enontekiö",1893,null,1.8098802395209581,36.63907191530101,-2693.0797675647123,null,null,null,53.294417606011812,238.2461701003698,8.1219163212946519,10706.814580031694,6594,2730,16897,-14167,6203,8824,null,null,-60,349,1149,348,0,0,801,0,0,0,801,1265,1149,null,-17,-608,777,6203,4963,410,830,21.25,null,77,1852,null,0.88922610015174508,34.843029143693037,-2738.1209503239743,null,null,null,54.992215528328707,183.04535637149027,6.4789506754634001,10312.095032397408,7223,2808,17628,-14820,6362,8604,null,null,-5,394,535,354,0,0,181,0,0,0,181,1446,487,null,174,-608,171,6362,5155,384,823,21.25,null,115,1838,null,0.60100398130517574,37.611123774789149,-3074.5375408052232,null,null,null,53.899776404051032,26.659412404787812,0.89304439007340086,10896.082698585418,6826,2496,17495,-14999,6263,8789,null,null,-32,376,397,366,0,0,31,-40,41,0,32,1478,323,null,-116,-600,-615,6263,5043,391,829,21.25,null,121,8260,8489,8657,null,null,null,-2514,2142,0,-522,97,109,-1632,480,214,0,-363,0,50,0,792,4511,3203,1308,1666,3953,2595,1358,1751,4145,1995,2150,1614,5492.3402007395671,5075.0539956803459,4935.2557127312293,237.31764705882352,129.11732701785829,null,null,null,null,null,874,-874]
[49,"Espoo",279044,null,3.6269561518125739,57.076201503058414,91.8887343931423,null,null,null,71.603623295301631,3413.5046802654779,169.63562909092681,7344.7377474520144,619229,336891,1679858,-1342967,1490270,36400,null,null,7246,39974,230923,144454,0,0,86469,11874,0,-41,98302,487912,204136,null,44571,-58022,-29967,1490270,1236961,137156,116153,18,null,28,283632,null,3.2449869501559614,54.038286452969281,-198.77869915947423,null,null,null,72.125280713237885,2995.2649912562761,143.62561683821261,7611.9549275117051,641447,392012,1767910,-1375898,1501986,43067,null,null,6717,19657,195529,161134,0,0,34395,-1606,0,12468,45257,525559,133450,null,-5982,-54463,-72387,1501986,1259684,125298,117004,18,null,14,289731,null,1.2679828897455558,62.609942523908373,-612.43360220342322,null,null,null,68.239032484472602,3083.7259388881412,140.18050340554214,8029.3617182835114,672439,418078,1886234,-1455718,1521184,60874,null,null,6894,38178,171412,178942,0,0,-7530,-2232,0,15025,5263,511808,85823,null,-46854,-57850,-115870,1521184,1272287,128604,120293,18,null,16,769017,819880,881701,null,null,null,-308439,42229,32107,-306855,36316,64702,-351520,57414,92413,30000,-23582,100000,-52872,220000,28508,805600,632921,172679,290265,798266,674452,123814,308687,988922,829753,159169,337799,12290.817935522715,12349.209539121113,13125.067735244071,70682.611111111109,243.95943516955765,null,null,null,null,null,55179,-55179]
[50,"Eura",11910,null,2.6784049715173484,50.811830240051954,-2931.9059613769941,null,null,null,48.096335238483178,162.38455079764904,8.5624006889608584,6922.166246851385,34664,11832,74927,-63095,44397,23837,null,null,-10,-4,5125,3535,0,0,1590,24,0,0,1614,7837,4653,null,-569,-1884,72,44397,39017,2303,3077,20.5,null,186,11748,null,-0.23776662484316186,56.974627154754991,-3319.7991147429348,null,null,null,43.377877999718123,184.79741232550219,9.4616716417910443,7128.8729996595166,35905,10999,77829,-66830,43565,22881,null,null,-11,-19,-414,3515,0,0,-3929,23,0,0,-3906,3931,-790,null,879,-1559,-4362,43565,38473,1964,3128,20.5,null,263,11632,null,-8.052813909405844E-2,68.531737386423345,-4063.961485557084,null,null,null,35.611809271841743,175.37826685006877,8.4635757072871325,7563.3596973865197,35650,10626,78529,-67900,43287,24118,null,null,-38,10,-523,3726,0,0,-4249,21,0,0,-4228,-290,-627,null,-1212,-1279,-8289,43287,38036,2057,3194,20.5,null,244,28965,29661,30278,null,null,900,-5390,164,645,-4158,75,511,-7966,7,297,0,1600,0,4000,5080,6000,28641,13067,15574,3280,31082,11828,19254,3023,40882,15601,25281,2942,4408.5642317380352,4619.1692202928152,5432.6856946354883,1855.4146341463415,159.50951118864697,null,null,null,null,null,818,-818]
[51,"Eurajoki",9521,null,6.4026402640264024,35.061224489795919,-15.859678605188529,null,null,null,78.670977539373453,2353.3242306480411,111.00962386827925,7737.7376326016174,26887,8230,64721,-56491,51919,13351,null,null,-16,820,9583,4906,0,0,4677,5,0,0,4682,75721,9583,null,-532,-1398,3557,51919,30562,2028,19330,18,null,11,9454,null,3.4361702127659575,34.307619956962277,259.25534165432623,null,null,null,79.677470120016892,2576.581341231225,124.06210755448888,7580.4950285593395,26361,8094,64344,-56250,50340,11737,null,null,-51,-724,5052,5212,0,0,-160,3,0,0,-157,75565,5052,null,1048,-1388,2484,50340,28914,2214,19212,18,null,38,9402,null,1.5512273827359686,31.894142633579253,562.32716443309937,null,null,null,80.063240168527415,2437.0346734737291,110.42774146695716,8055.2010210593489,27266,8388,70036,-61648,52060,11120,null,null,28,1770,3330,4915,0,0,-1585,3,-112,0,-1694,73816,3330,null,-3037,-1088,-773,52060,28952,2581,20527,18,null,71,30985,31318,35296,null,null,null,-6535,20,489,-4044,16,1460,-4201,24,74,0,-422,0,-425,0,-442,15454,13759,1695,3779,13642,12023,1619,3622,12112,10456,1656,105,1842.7686167419388,1704.1463930611383,1570.7296319931929,1608.4444444444443,171.07471223616724,null,null,null,null,null,701,-701]
[52,"Evijärvi",2499,null,718,32.495003331112592,466.18647458983594,null,null,null,69.962742926190714,2573.4293717486994,128.65524801315431,7300.9203681472591,3890,1678,17797,-16119,8224,8110,null,null,95,407,717,494,0,0,223,0,0,0,223,5147,717,null,-162,0,366,8224,6674,827,723,21.5,null,251,2473,null,{"$error":"#DIV/0!"},36.481064145550484,-57.015770319450063,null,null,null,65.704264728307834,2420.9462191670036,110.90975993503527,7967.2462596037203,4036,1829,18407,-16578,7975,8389,null,null,51,-293,-456,514,0,0,-970,0,0,0,-970,4177,-521,null,78,0,-1308,7975,6586,639,750,21.5,null,284,2425,null,-0.25462690086054462,48.008149697067182,-688.65979381443299,null,null,null,57.20260443895252,2752.5773195876291,115.85786295116269,8671.7525773195885,4135,1744,19558,-17814,8047,8860,null,null,58,579,-270,619,0,0,-889,0,0,0,-889,3287,-275,null,-101,0,-1492,8047,6699,584,764,21.5,null,262,12449,12714,13692,null,null,null,-424,51,22,-956,75,94,-1384,160,7,0,950,0,550,0,1000,4950,0,4950,201,5500,0,5500,194,6500,0,6500,187,2915.1660664265705,3319.8544278204613,3919.5876288659792,311.58139534883719,128.48717333972667,null,null,null,null,null,500,-500]
{"$rows_left_out":283}