{"text_format":"1","workbook":"xlsx","n_sheets":2,"sheets":["Kuntakortti","Luvut"],"not_rendered":{"charts":0,"images":0,"macros":1,"external_links":0,"defined_names":2,"comments":0,"pivot_tables":0},"unopened":[],"bounds":{"document_bytes":16777216,"sheet_cells":100000,"rows_first":2000,"rows_last":500,"rows_between":2000,"halvings":0,"cell_chars":16384,"cell_head_chars":4096},"cells_cut":0,"cells_raw":0,"read":"whole","date_system":"1900"}

{"sheet":"Kuntakortti","index":0,"n_rows":74,"n_cols":12,"rows_kept":74,"cut":false,"hidden":false,"merged":[[1,4,1,5]]}
["VM/KAO, 1.9.2025",null,null,null,null,null,null,null,null,null,null,"Huom! Puuttuu Kemijärvi ja Tervola tp2024"]
["KUNTAKONSERNIN KESKEISIÄ TILINPÄÄTÖSTIETOJA",null,null,null,"Valitse kunta valikosta:"]
[null,null,null,null,null," "]
[{"$f":"INDEX(Luvut!$B$3:'Luvut'!$B$296,$A$7)","v":"Koko maa (Manner-Suomi)"},2022,null,null,2023,null,null,2024]
[]
["Asukasluku",{"$f":"VLOOKUP($A$4,Luvut!$B$3:$DU$296,2)","v":5533611},null,null,{"$f":"VLOOKUP($A$4,Luvut!$B$3:$DU$296,43)","v":5573310}," ",{"$f":"((E6/B6)-1)*100","v":0.71741580678512662},{"$f":"VLOOKUP($A$4,Luvut!$B$3:$DU$296,84)","v":5605317}," ",{"$f":"((H6/E6)-1)*100","v":0.5742906818389848}]
[95," "]
["Tunnuslukuja"," "]
[]
["Tuloveroprosentti",{"$f":"VLOOKUP($A$4,Luvut!$B$3:$DU$296,3)","v":20.010000000000002}," ",null,{"$f":"VLOOKUP($A$4,Luvut!$B$3:$DU$296,44)","v":7.32}," ",null,{"$f":"VLOOKUP($A$4,Luvut!$B$3:$DU$296,85)","v":7.47}," "]
{"$rows_left_out":65}
{"sheet":"Luvut","index":1,"n_rows":296,"n_cols":137,"rows_kept":296,"cut":false,"hidden":false,"merged":[]}
[null,null,2022,3,4,5,6,7,8,9,10,11,12,13,14,15,16,17,18,19,20,21,22,23,24,25,26,27,28,29,30,31,32,33,34,35,36,37,38,39,40,41,42,2023,44,45,46,47,48,49,50,51,52,53,54,55,56,57,58,59,60,61,62,63,64,65,66,67,68,69,70,71,72,73,74,75,76,77,78,79,80,81,82,83,2024,85,86,87,88,89,90,91,92,93,94,95,96,97,98,99,100,101,102,103,104,105,106,107,108,109,110,111,112,113,114,115,116,117,118,119,120,121,122,123,124,"Erillistiedot",2022,2023,2024,129,2022,2023,2024,null,2020,2021,2022]
["Kunta nro","Kunta","Asukasluku ","Tuloveroprosentti 2015","Lainanhoitokate","Suhteellinen velkaantuneisuus-%","Omavaraisuusaste, %","Rahavarat","Kassan riittävyys, pv","Toimintatuotot","Toimintakulut","Osuus osakkuusyhteisojen voitosta/tappiosta","Toimintakate","Verotulot","Valtionosuudet","Korkotuotot","Korkokulut","Muut rahoitustuotot/-menot, netto (sis Osinkotuotot)","Vuosikate","Suunnitelman mukaiset poistot ja arvonalet","Satu. erät, netto","Tilikauden tulos","Tilinpäätössiirrot","Tilikauden verot","Lask. Verot","Vähemmistöosuudet","Tilikauden yli- tai alijäämä","Kumulat yli/alij","Toiminnan rahavirta"," - Investointimenot"," + Rahoitusos. investointimenoihin"," + Investointihyödykk. luovutustulot","Antolainauksen muutokset (lisäys -, vähennys +)","Pitkäaikaisten lainojen vähennys","Pitkäaikaisten lainojen lisäys"," ± Lyhytaikaisten lainojen muutos","Toim ja inv rahavirta","Lainakanta","josta pitkäaik","josta lyhytaik","Lainasaamiset","Vuokravastuut","Sijoitus vuosikatteen mukaan","Asukasluku ","Tuloveroprosentti 2019","Lainanhoitokate","Suhteellinen velkaantuneisuus-%","Omavaraisuusaste, %","Rahavarat","Kassan riittävyys, pv","Toimintatuotot","Toimintakulut","Osuus osakkuusyhteisojen voitosta/tappiosta","Toimintakate","Verotulot","Valtionosuudet","Korkotuotot","Korkokulut","Muut rahoitustuotot/-menot, netto (sis Osinkotuotot)","Vuosikate","Suunnitelman mukaiset poistot ja arvonalet","Satu. erät, netto","Tilikauden tulos","Tilinpäätössiirrot","Tilikauden verot","Lask. verot","Vähemmistöosuudet","Tilikauden yli- tai alij.","Kumulat yli/alij","Toiminnan rahavirta"," - Investointimenot"," + Rahoitusosuudet investointimenoihin"," + Investointihyödykkeiden luovutustulot","      Antolainauksen muutokset (lisäys -, vähennys +)","Pitkäaikaisten lainojen vähennys","Pitkäaikaisten lainojen lisäys"," ± Lyhytaikaisten lainojen muutos","Toim ja inv rahavirta","Lainakanta","josta pitkäaik","josta lyhytaik","Lainasaamiset","Vuokravastuut","Sijoitus vuosikatteen mukaan","Asukasluku","Tuloveroprosentti 2020","Lainanhoitokate","Suhteellinen velkaantuneisuus-%","Omavaraisuusaste, %","Rahavarat","Kassan riittävyys, pv","Toimintatuotot","Toimintakulut","Osuus osakkuusyhteisojen voitosta/tappiosta","Toimintakate","Verotulot","Valtionosuudet","Korkotuotot","Korkokulut","Muut rahoitustuotot/-menot, netto (sis Osinkotuotot)","Vuosikate","Suunnitelman mukaiset poistot ja arvonalet","Satu. erät","Tilikauden tulos","Tilinpäätössiirrot","Tilikauden verot","Lask. verot","Vähemmistöosuudet","Tilikauden yli- tai alijäämä","Kumulat yli/alij","Toiminnan rahavirta"," - Investointimenot"," + Rahoitusosuudet investointimenoihin"," + Investointihyödykkeiden luovutustulot","      Antolainauksen muutokset (lisäys -, vähennys +)","Pitkäaikaisten lainojen vähennys","Pitkäaikaisten lainojen lisäys"," ± Lyhytaikaisten lainojen muutos","Toim ja inv rahavirta","Lainakanta","josta pitkäaik","josta lyhytaik","Lainasaamiset","Vuokravastuut","Sijoitus vuosikatteen mukaan",null,"Muut omat rahastot","Muut omat rahastot","Muut omat rahastot",null,"Hark.var.korotus","Hark.var.korotus","Hark.var.korotus",null,"Takaukset muiden puolesta (jäljellä oleva pääoma)","Takaukset muiden puolesta (jäljellä oleva pääoma)","Takaukset muiden puolesta (jäljellä oleva pääoma)"]
[20,"Akaa",16473,22,0.93119091620011407,77.142611055776499,18.493719268453649,9344.3098100000007,16.290895468491449,71683.581260000006,173187.90008000002,667.14194999999995,-100837.17687000001,69399.148969999995,38886.780200000001,377.10453000000001,1041.5083500000001,379.58956999999992,7163.9380499999997,7608.3815100000002,24.892669999999999,-419.55079000000001,1.2755999999999998,142.22542999999999,-33.408199999999994,-252.44684000000001,-846.35566000000006,-580.21133000000009,6235.2962400000006,-27184.646800000002,528.25933999999995,1691.01757,4.7486699999999997,-7770.2683299999999,35302.810450000004,-14372.780150000001,-18730.073649999998,109151.71983,82725.231579999992,26426.488249999999,7670.5319500000005,11597.089199999999,253,16405,9.36,3.5080653407063331,175.07783992304235,19.42316719704581,179.45281,0.94613946043889929,9398.5214600000018,52115.260679999999,123.40158,-42593.337639999998,38946.102610000002,12622.80838,519.64599999999996,2288.60752,266.52463,7473.1364599999997,6919.1013300000004,0,554.03512999999998,0.22119999999999998,0.40961000000000003,-3.94,28.33539,578.24211000000003,-3425.1219799999999,7352.9310800000003,14064.54349,13.2425,164.53005999999999,420,-494.04988000000003,13000,-3412.4995899999999,-6533.8398499999994,97654.055810000005,73070.52072,24583.535090000001,7227.2380700000003,4489.6440999999995,244,16387,9.9,1.011513035288784,190.82170440368378,18.077479251202245,9554.09375,53.470736304685886,10099.190939999999,50274.359520000005,172.57348000000002,-40002.595099999999,40347.032060000005,8990.3692599999995,614.70398,3075.8298500000001,278.45952999999997,7152.1398799999997,8138.9803899999997,0,-986.84050999999999,0.22119999999999998,0.33513999999999999,-33.228000000000002,-5.8056200000000002,-1025.8205,-4185.2639300000001,6766.2814400000007,4553.4340000000002,166.06842,469.97507999999999,0,7035.7251900000001,19897.650000000001,-5525.4860699999999,2848.8909399999998,104990.49455,60989.792270000005,44000.702279999998,7235.2380700000003,7425.3551799999996,245,null,9.4302199999999985,8.8227000000000011,8.6015100000000011,null,null,410,null,null,14631]
[5,"Alajärvi",9183,21.75,1.0415161776171413,45.793077355428863,33.302222615640957,9129.52837,21.548509244461783,73503.042719999998,140554.40445,196.04211999999998,-66855.319610000006,32479.353719999999,41621.538659999998,12.63185,260.45882,61.47332999999999,7059.2191299999995,6370.9837200000002,0,688.23541,0,25.311910000000001,-2.8101100000000003,16.029489999999999,676.14287999999999,9487.72156,6612.2325000000001,-5728.4627499999997,401.59066999999999,473.38396999999998,9.4525699999999997,-6767.44733,1473.6714399999998,74.838250000000002,1758.7443899999998,45229.486730000004,33421.319390000004,11808.16734,92.870500000000007,484.10521,144,9113,9.11,1.7690425595911241,69.660347689341336,47.718140056749782,8314.0888599999998,54.436981020734287,20092.255410000002,47311.961459999999,132.46233999999998,-27087.243710000002,18620.641760000002,17437.39241,45.403150000000004,524.75118999999995,183.00004000000001,8674.4424600000002,5022.6077000000005,0,3651.8347599999997,0,33.713889999999999,2.8704000000000001,8.8975000000000009,3629.88877,13315.98142,8446.9869499999986,3050.9133400000001,7.8563900000000002,110.55450999999999,48.217199999999998,-4675.3462300000001,3362.23911,0,5514.4845100000002,30309.26426,20347.665789999999,9961.5984700000008,41.321510000000004,193.71905999999998,89,9078,9.1,1.9324248106115054,63.329471465594999,54.472265286963008,8734.6514399999996,56.403577194054712,20550.885770000001,47574.345079999999,139.81837999999999,-26883.640930000001,19597.624379999997,16159.89157,60.448180000000001,679.12433999999996,128.88905000000003,8384.0879100000002,5123.0761299999995,0,3261.0117799999998,0,93.266460000000009,3.1347300000000002,-8.3997199999999985,3209.1135600000002,16957.823280000001,7955.6909500000002,4130.5512600000002,121.19658,9.5531100000000002,6.8956999999999997,4010.94805,72.85466000000001,0,3955.8893800000001,26146.768790000002,16598.514810000001,9548.2539800000013,34.425809999999998,45.151890000000002,85,null,37.115739999999995,40.365110000000001,40.365110000000001,null,null,null,null,null,498]
[9,"Alavieska",2447,22,29.082239952236421,44.425831205692106,42.886073951626074,7551.13969,71.871936017545679,17797.693850000003,35441.338619999995,3.8393899999999999,-17639.805379999998,9070.3866600000001,11441.820460000001,362.04586,49.856540000000003,-187.12994,2997.4611199999999,1173.77602,0,1823.6851000000001,-2.4397899999999999,1.0835699999999999,-2.6600000000000002E-2,-0.61714000000000002,1819.518,5512.2818499999994,3028.84762,-2380.2151699999999,6.8373599999999994,66.484210000000004,-181.2,-54.926230000000004,963.8,-0.99478,721.95402000000001,13563.918800000001,2458.3458700000001,11105.57293,231.29587000000001,29.539080000000002,47,2437,9.36,6.7692884299071014,77.961950085056245,55.383651329674123,5316.2270499999995,136.65238484971007,3988.9176499999999,11747.910599999999,12.066240000000001,-7746.9267099999997,4923.7195599999995,4520.2201500000001,30.93572,243.79504999999997,186.37254000000001,1670.52621,1247.41443,-10.54,412.57178000000005,1.29386,3.5845799999999999,0,0,410.28106000000002,5893.3795300000002,1643.9848300000001,1982.62184,25.147740000000002,47.236359999999998,6.3,-39,0,-1998.88193,-266.25290999999999,9042.18649,15.5,9026.68649,237.9,58.325000000000003,184,2410,9.3000000000000007,6.2993592031953751,99.242319722929693,53.318734137484682,6205.3219900000004,177.57606368324932,2908.7699700000003,10510.11701,8.9897299999999998,-7592.3573099999994,4857.3606399999999,4529.9661500000002,59.013539999999999,332.95153999999997,288.59622999999999,1809.62771,1094.72009,0,714.90761999999995,-1.79548,0.77700000000000002,0,0,712.72364000000005,6793.6177399999997,1797.02287,2682.5090299999997,423.64403000000004,63.786569999999998,1071.3,7.1749999999999998,-1366.575,1775.19588,-398.05556000000001,10887.282369999999,0,10887.282369999999,548.6,92.296999999999997,141,null,121.17480999999999,81.30789,80.203500000000005,null,null,null,null,null,2732]
[10,"Alavus",11102,21.25,0.85155867453042078,65.555255438802888,34.033768028132108,30658.56205,61.991903211640434,83034.939939999997,158446.12218999999,578.37410999999997,-74832.808139999994,37647.463219999998,45138.767,35.014559999999996,534.14821999999992,-844.76071000000002,6609.5277100000003,8271.5507899999993,0,-1662.0230800000002,19.38,14.484639999999999,-34.455059999999996,28.142869999999998,-1663.4399099999998,23149.482379999998,5787.0686900000001,-11838.00359,463.78228999999999,468.60924,251.50908999999999,-7854.79331,11399.4247,-1212.14319,-5118.5433700000003,89987.110780000003,81178.58726,8808.5235199999988,1737.1893500000001,2013.722,206,10933,8.61,0.8303889279954566,177.66208083473197,36.252744962972137,30138.606219999998,160.20813707152863,18086.034920000002,44951.001349999999,661.18295000000001,-26203.783480000002,20754.290659999999,12378.599,58.172330000000002,1617.7236699999999,1447.02037,6816.57521,7360.6696700000002,-221.17342000000002,-765.26787999999999,10,13.119399999999999,-13.438000000000001,2.9853200000000002,-778.83996000000002,23125.215119999997,5340.0000499999996,11953.5674,884.25893999999994,2762.9071400000003,102.04414,-8539.3227399999996,13317.098800000002,-421.94792999999999,-2966.4012699999998,79302.655979999996,72305.717609999992,6996.9383699999998,1659.4216200000001,1450.8610000000001,199,10780,9.6,1.1438034791977358,163.21764658242301,38.313705034963519,25707.298340000001,153.73882374524513,17134.90929,43607.421759999997,95.140079999999998,-26377.37239,22573.237739999997,12813.030939999999,45.819110000000002,1859.23712,989.83519999999999,8185.3134800000007,6806.7005599999993,0,1378.61292,0,11.13602,-20.72,11.10548,1363.43039,24599.677460000003,7850.5718699999998,7594.1239100000003,316.01853000000006,856.53048000000001,129.94927000000001,6922.4730099999997,217.6,2434.28406,1428.9969699999999,75246.87840999999,65800.718219999995,9446.1601899999987,1648.3067900000001,1332.73,137,null,410.82266999999996,278.02803,278.02813000000003,null,null,null,545,null,1299]
[16,"Asikkala",8014,20.75,19.179203928187093,33.163915099366463,53.955895199068543,5604.3059800000001,16.992690657823001,48764.511060000004,102135.31515000001,-16.533049999999999,-53387.337149999999,33560.072229999998,25532.793719999998,-19.522479999999998,58.843650000000004,495.80898999999999,6122.9716600000002,3580.5704300000002,-13.672120000000001,2528.7291099999998,-0.52194000000000007,-2.8000000000000003E-4,-4.4350899999999998,0.69516,2524.4675200000001,23193.11922,6780.3546299999998,-17787.586629999998,83.225970000000004,121.61186000000001,14.374499999999999,-263.47501,1598.4,5076.2871699999996,-10802.39416,20242.09446,10208.17641,10033.91805,68.60202000000001,16438.077269999998,146,7968,8.11,9.125060223482766,57.64572061179198,66.199097608031323,2557.03325,20.512285224036813,8786.0314299999991,31668.344300000001,4.28627,-22878.026600000001,18088.488839999998,12731.768119999999,243.69968,355.02100999999999,-6.3139299999999929,7824.5950999999995,3728.2835399999999,-2.24735,4094.06421,-1.04226,0,-52.930599999999998,0,4040.0913500000001,27444.24481,8510.0900299999994,12941.977000000001,480.54323999999997,4725.9539800000002,0,-541.36936000000003,0,685.26983999999993,774.61024999999995,14864.742020000002,2048.3455100000001,12816.39651,60.166019999999996,762.78575000000001,82,7889,8.1,5.5307546591670729,76.396700602100751,61.397948726515864,2785.2491800000003,23.205975928971334,8829.3646599999993,31785.78685,3.7205100000000004,-22952.701690000002,17755.133280000002,10340.966560000001,44.81221,501.58151000000004,93.735039999999998,4780.36391,4506.1731,-3.0708000000000002,272.65540999999996,-0.9869,0,-27.901049999999998,0,243.76746,27688.012269999999,4885.7971299999999,10973.833349999999,67.794640000000001,159.73737,0,453.43200000000002,39.9,5377.0354900000002,-5860.5042000000003,19828.245510000001,1634.81351,18193.432000000001,60.166019999999996,826.70561999999995,191,null,0,0,0,null,null,null,null,null,0]
[18,"Askola",4763,21.5,1.4083317938380251,68.782272534923862,34.34340920927341,10351.80898,72.269288716612522,19409.226549999999,47234.529040000001,-175.72783999999999,-28001.030329999998,22920.387469999998,8769.3430000000008,19.840949999999999,233.04207,-252.34680999999995,3223.1522099999997,2154.83716,0,1068.3150500000002,-128.66480999999999,11.68155,0,0.57530999999999999,928.54399999999998,7338.8859900000007,3029.1271000000002,-1902.26423,5.1803599999999994,208.99598999999998,2.3582800000000002,-2221.06306,462.17065000000002,-1010.2144599999999,1341.0392199999999,28251.469130000001,21556.780780000001,6694.6883499999994,0,2779.0159100000001,180,4700,8.86,1.2597862639333175,110.46520620115643,47.232029174982614,8489.0090999999993,123.40413090785673,8450.6453799999999,21191.74986,-73.283829999999995,-12814.38831,11859.325510000001,3522.4180000000001,62.037790000000001,599.36077,330.85979000000003,2360.8920099999996,1905.62114,0,455.27087,-4.9642400000000002,18.415839999999999,0,0,431.89078999999998,13359.798889999998,2285.6573199999998,1236.0499399999999,-0.99360000000000004,96.396600000000007,0,-1750.4448,0,-592.21504000000004,1145.0103799999999,22892.62717,16937.80932,5954.8178499999995,0,1008.55607,232,4651,8.9,1.2849580935882752,130.44596100844157,41.865725582067476,9747.529050000001,120.51432524894,8646.5740500000011,21763.063620000001,111.79099000000001,-13004.69858,11940.992759999999,3110.1590000000001,17.198430000000002,665.92850999999996,701.76071000000002,2099.4838100000002,2509.0024500000004,0,-409.51864,0.43930999999999998,48.464220000000005,0,0,-433.31144,12804.81307,2094.2089000000001,4905.2343899999996,0,56.122099999999996,0,1486.21352,6000,-497.22954999999996,-2754.9033899999999,26861.435819999999,21251.784299999999,5609.6515199999994,310.27365000000003,1053.5092999999999,242,null,1921.8168999999998,0,1754.34006,null,null,null,null,null,2000]
[19,"Aura",3965,21.5,1.5354698199588088,46.599954574994669,35.097496913856119,3672.933,32.771547792982659,13741.87658,36512.070540000001,-5.2591800000000006,-22775.453140000001,16693.933199999999,7963.9655700000003,6.3792600000000004,94.00658,48.156960000000005,1842.9752699999999,1429.92283,0,413.05243999999999,-83.826630000000009,0.14141000000000001,-20.323400000000003,-38.768149999999999,269.99284999999998,5776.9669399999993,1824.21921,-3111.0809800000002,67.231399999999994,43.887910000000005,0,-1167.4847400000001,3976.3372200000003,-2237.5767500000002,-1175.7424599999999,11852.531989999999,7520.6075700000001,4331.9244200000003,0,10436.174429999999,244,3961,8.86,1.3255946317722187,67.99755485490391,46.083297097376644,1156.865,24.65706948480527,3715.4181100000001,14438.434439999999,-0.27964,-10723.295970000001,8905.6408699999993,3574.93694,4.6663100000000002,128.72055,13.78337,1647.01097,1015.92416,85.935820000000007,717.02263000000005,-94.237820000000013,2.1989999999999999E-2,-21.398,-43.025199999999998,558.33961999999997,6345.9692599999998,1638.90201,1332.75368,38.19,567.03694999999993,-0.59325000000000006,-1210.85301,0,431.21996000000001,911.37527999999998,8378.3371399999996,5287.4112699999996,3090.92587,0,9518.7520000000004,254,3966,8.9,0.58898327455558619,81.696380949851573,42.444017873619593,1239.5723899999998,27.904705658672583,3149.6307599999996,13822.196310000001,0.34555000000000002,-10672.22,8821.3701500000006,2547.8528900000001,3.2728899999999999,177.10189000000003,43.718900000000005,566.89293000000009,1166.0820200000001,0.45200000000000001,-582.17147,-93.98,0.62546000000000002,-17.143999999999998,-32.889789999999998,-726.49798999999996,4601.2272299999995,503.20069999999998,1084.7931999999998,54.615000000000002,169.18135000000001,0,1086.0830800000001,2000,-2.4648600000000003,-357.79615000000001,9289.7892199999987,4756.88375,4532.9054699999997,0,8919.1309999999994,279,null,14.42187,10.024979999999999,10.024979999999999,null,null,null,null,null,773]
[46,"Enonkoski",1341,21,56.483500536206897,20.670838467675587,71.058687236440917,7132.8191100000004,111.467156712841,11315.894490000001,21512.980079999998,0,-10197.085590000001,5157.2429199999997,6663.5733600000003,14.009540000000001,29.105820000000001,66.644880000000001,1675.2792899999999,811.87175999999999,26.982310000000002,890.38983999999994,0,0,0.79634000000000005,0,891.18618000000004,10315.152,1679.94893,-1768.9834099999998,1.04718,4.4403800000000002,-1.6676300000000002,-1.0690999999999999,228.52073000000001,177.61217000000002,-83.54692,1865.1834199999998,1311.3798400000001,553.80358000000001,7,396.45865000000003,44,1320,8.36,14.708722170936554,14.486723535990256,85.877121075923441,6749.12039,337.08395408138529,2025.1452400000001,6369.8621499999999,0,-4344.7169100000001,2873.9903799999997,2543.7663399999997,112.42671,1.49925,129.35145,1313.31872,659.04062999999996,11.104100000000001,665.38218999999992,0,0.43995999999999996,13.479200000000001,0,678.4214300000001,10714.96054,1306.8225400000001,654.66069999999991,0,14.56395,-64.792910000000006,-87.891109999999998,30.750330000000002,0,666.72579000000007,90.588269999999994,74.467860000000002,16.12041,71.792910000000006,75.351759999999999,80,1288,8.4,132.30955304018801,14.525779570919212,86.18915951154402,7589.8840499999997,372.46711945131949,2213.1512400000001,6790.1799099999998,0,-4577.0286699999997,2934.2680099999998,2589.77547,136.50432000000001,1.83152,151.54026999999999,1233.2278799999999,777.69650000000001,0,455.53138000000001,-1.0102800000000001,2.3482800000000004,22.841519999999999,0,476.18847999999997,11191.149009999999,1225.32635,484.30836999999997,0,49.05847,71.792910000000006,7.5031000000000008,-19.436640000000001,0,790.07644999999991,63.648530000000001,54.92163,8.7268999999999988,0,82.379499999999993,72,null,18.52215,8.9897200000000002,10,null,null,null,null,null,108]
{"$rows_left_out":286}