{"text_format":"1","workbook":"xlsx","n_sheets":4,"sheets":["selite","KEHIKKO","pohjatiedot","väestöennuste"],"not_rendered":{"charts":2,"images":0,"macros":0,"external_links":1,"defined_names":3,"comments":0,"pivot_tables":0},"unopened":[],"bounds":{"document_bytes":16777216,"sheet_cells":100000,"rows_first":2000,"rows_last":500,"rows_between":2000,"halvings":0,"cell_chars":16384,"cell_head_chars":4096},"cells_cut":0,"cells_raw":0,"read":"whole","date_system":"1900"}

{"sheet":"selite","index":0,"n_rows":75,"n_cols":8,"rows_kept":75,"cut":false,"hidden":false,"merged":[]}
["VALTIOVARAINMINISTERIÖ/Kunta- ja aluehallinto-osasto/vjl",null,null,null,null,null,null,"2021-06-10"]
[]
["KUNTAKONSERNIN TALOUDEN SUUNNITTELUKEHIKKO"]
[]
["Tämä ei ole kuntakohtainen ennuste, vaan apuväline kunnalle tulevan kehityksen "]
["ja kunnassa suoritettavien eri toimenpiteiden talousarviointiin"]
[]
["Suunnittelukehikossa ei ole voitu ottaa koronan vaikutuksia täysimääräisesti valtionosuuksiin tai verotuloihin"]
["vuosien 2021 ja 2022 kohdalla, myöskään erilaisten tukipakettien lopullinen kunta-arvio ei ole selvillä"]
[]
["Kehikon käyttötarkoitus:"]
["Vuorovaikutteinen kuntakonsernin talouden suunnittelun apuväline. Kehikon avulla voidaan suunnitella konsernin talouden"]
["kehitystä pidemmällä aikavälillä. Tarkastelun kohteena ovat konsernin tuloslaskelma, rahoituslaskelmasta rahavarat, antolainat ja"]
["investoinnit sekä taseesta lainat ja kertynyt yli-/alijäämä. Pohjatietoina kehikossa ovat 2 viimeksi "]
["valmistunutta tilinpäätöstä. "]
["Tulevan kehityksen osalta tuloslaskelman erien kasvuolettamukset pohjautuvat lähtökohtaisesti uusimman valtion"]
["kuntatalousohjelman (KTO) vuosien 2022-2025 (toukokuu 2021) mukaisiin makroarviolukuihin - ei kuntakohtaisiin ennusteisiin. "]
["Käyttäjä voi kuitenkin itse muokata em. kasvuolettamuksia sekä yleensä tuloslaskelman muita eriä."]
["Myös tuloveroprosenttia, investointeja ja antolainasaamisten määrää voidaan muuttaa."]
["Rahoituslaskelman ja taseen erät pohjautuvat jäljempänä selostettuihin olettamuksiin"]
{"$rows_left_out":56}
{"sheet":"KEHIKKO","index":1,"n_rows":118,"n_cols":16,"rows_kept":118,"cut":false,"hidden":false,"merged":[]}
["Valtiovarainministeriö/Kunta- ja aluehallinto-osasto/vjl",null,null,null,null,null,null,"VALITSE KUNTA:",null,null,null,"2021-06-10"]
["KUNTAKONSERNIN TALOUDEN SUUNNITTELUKEHIKKO",null,null,null,null,null,null,null,null,"Kunnat vuoden 2021 jaolla"]
["Muokkaa vaaleansinisellä olevia kohtia.",null,null,null,null,12.39]
[{"$f":"INDEX(pohjatiedot!$B$3:$B$296,KEHIKKO!$A$5)","v":"KOKO MAA (Manner-Suomi)"},null,null,null,null,"%-vähennys "]
[95,"TP 2019","TP 2020",2021,2022,2023,2024,2025,2026,2027,2028,2029,2030]
["TULOSLASKELMA",null,{"$f":"((C7/B7)-1)*100","v":0.15023452307818541},{"$f":"((D7/C7)-1)*100","v":4.9457961096455172E-2},9.7813702126958724E-2,8.968077779705208E-2,8.0609565656364346E-2,7.0148276757686645E-2,5.8768858477820096E-2,4.6795731476789726E-2,0,5.3499730331707518E-2,0,"Väestön muutos%"]
["Asukasluku 31.12.",{"$f":"VLOOKUP($A$4,pohjatiedot!$B$3:$CF$296,2)","v":5495408},{"$f":"VLOOKUP($A$4,pohjatiedot!$B$3:$CF$296,42)","v":5503664},{"$f":"VLOOKUP($A$4,väestöennuste!$A$7:$J$302,4)","v":5506386},{"$f":"VLOOKUP($A$4,väestöennuste!$A$7:$J$302,5)","v":5511772},{"$f":"VLOOKUP($A$4,väestöennuste!$A$7:$J$302,6)","v":5516715},{"$f":"VLOOKUP($A$4,väestöennuste!$A$7:$J$302,7)","v":5521162},{"$f":"VLOOKUP($A$4,väestöennuste!$A$7:$J$302,8)","v":5525035},{"$f":"VLOOKUP($A$4,väestöennuste!$A$7:$J$302,9)","v":5528282},{"$f":"VLOOKUP($A$4,väestöennuste!$A$7:$J$302,10)","v":5530869},{"$f":"VLOOKUP($A$4,väestöennuste!$A$7:$J$302,10)","v":5530869},{"$f":"VLOOKUP($A$4,väestöennuste!$A$7:$L$302,12)","v":5533828},{"$f":"VLOOKUP($A$4,väestöennuste!$A$7:$M$302,13)","v":5533828},"Väestöennuste TK 2019"]
["Veroprosentti",{"$f":"VLOOKUP($A$4,pohjatiedot!$B$3:$CF$296,3)","v":19.899999999999999},{"$f":"VLOOKUP($A$4,pohjatiedot!$B$3:$CF$296,43)","v":19.96},{"$f":"VLOOKUP($A$4,pohjatiedot!$B$3:$CI$296,83)","v":20.02},{"$f":"D8","v":20.02},{"$f":"E8-$F$3","v":7.629999999999999},{"$f":"F8","v":7.629999999999999},{"$f":"G8","v":7.629999999999999},{"$f":"H8","v":7.629999999999999},{"$f":"I8","v":7.629999999999999},{"$f":"J8","v":7.629999999999999},{"$f":"K8","v":7.629999999999999},{"$f":"L8","v":7.629999999999999}]
["vero-% yksikön tuotto",{"$f":"B15/B8","v":937917.98994974885},{"$f":"C15/C8","v":1008219.6893787575},{"$f":"D15/D8","v":1025359.4240981963},{"$f":"E15/E8","v":1063297.7227898294},1291740.8977649875,1225862.1119789733,1249153.4921065737,1272887.4084565984,1297072.2692172735,1321716.6423324014,1346829.2585367167,1372419.0144489142]
[" → noston vaikutus",null,null,{"$f":"(D8-C8)*C9","v":60493.181362724157},{"$f":"(E8-D8)*D9","v":0},{"$f":"(F8-E8)*E9","v":-13174258.785365986},{"$f":"(G8-F8)*F9","v":0},0,0,0,0,0,0]
["Toimintatuotot (sis. valm. okäytt.)",{"$f":"VLOOKUP($A$4,pohjatiedot!$B$3:$CF$296,6)","v":26773679},{"$f":"VLOOKUP($A$4,pohjatiedot!$B$3:$CF$296,46)","v":26450859},{"$f":"C11*(1+D70/100)","v":30735898.157999996},{"$f":"D11*(1+E70/100)","v":28184818.610885996},{"$f":"E11*(1+F70/100)","v":19165676.655402474},{"$f":"F11*(1+G70/100)","v":19395664.775267303},{"$f":"G11*(1+H70/100)","v":19589621.423019975},19785517.637250174,19983372.813622676,20183206.541758902,20385038.60717649,20588888.993248254,null,"Näiden erien muutos-"]
["Toimintakulut",{"$f":"VLOOKUP($A$4,pohjatiedot!$B$3:$CF$296,7)","v":54871181},{"$f":"VLOOKUP($A$4,pohjatiedot!$B$3:$CF$296,47)","v":55390857},{"$f":"C12*(1+D71/100)","v":57994227.278999999},59386088.733695999,{"$f":"E12*(1+F71/100)","v":27080056.462565374},{"$f":"F12*(1+G71/100)","v":27513337.365966421},27953550.763821885,28400807.576043036,28855220.497259725,29316904.025215879,29785974.489619333,30262550.081453241,null,"prosentit syötetään"]
["Osuus osakk.yht. voitoista/tappioista",{"$f":"VLOOKUP($A$4,pohjatiedot!$B$3:$CF$296,8)","v":70720},{"$f":"VLOOKUP($A$4,pohjatiedot!$B$3:$CF$296,48)","v":93462},{"$f":"C13","v":93462},{"$f":"D13","v":93462},{"$f":"E13","v":93462},93462,93462,93462,93462,93462,93462,93462,null,"alla olevaan taulukkoon"]
["Toimintakate",{"$f":"B11-B12+B13","v":-28026782},{"$f":"C11-C12+C13","v":-28846536},{"$f":"D11-D12+D13","v":-27164867.121000003},{"$f":"E11-E12+E13","v":-31107808.122810002},-7820917.8071628995,-8024210.5906991176,-8270467.3408019096,-8521827.938792862,-8778385.683637049,-9040235.4834569767,-9307473.8824428432,-9580199.0882049873]
["Kunnallisverot",{"$f":"VLOOKUP($A$4,pohjatiedot!$B$3:$CF$296,9)","v":18664568},{"$f":"VLOOKUP($A$4,pohjatiedot!$B$3:$CF$296,49)","v":20124065},{"$f":"(C15+D10)*(1+D72/100)","v":20527695.670445889},{"$f":"(D15+E10)*(1+E72/100)","v":21287220.410252385},{"$f":"E15*(1+F72/100)","v":9855983.0499468539},{"$f":"(F15+G10)*(1+G72/100)","v":9353327.9143995643},9531041.1447731555,9712130.9265238438,9896661.414127795,10084697.980996221,10276307.242635148,10471557.080245214]
["Yhteisöverot  ",{"$f":"VLOOKUP($A$4,pohjatiedot!$B$3:$CF$296,10)","v":1866127},{"$f":"VLOOKUP($A$4,pohjatiedot!$B$3:$CF$296,50)","v":1956930},{"$f":"C16*(1+D73/100)","v":2473559.52},{"$f":"D16*(1+E73/100)","v":2077789.9967999998},{"$f":"E16*(1+F73/100)","v":1493931.0076991997},1384874.0441371582,1443038.7539909189,1503646.3816585375,1566799.5296881963,1632605.1099351007,1701174.5245523748,1772623.8545835747]
["Kiinteistöverot",{"$f":"VLOOKUP($A$4,pohjatiedot!$B$3:$CF$296,11)","v":1790525},{"$f":"VLOOKUP($A$4,pohjatiedot!$B$3:$CF$296,51)","v":1744593},{"$f":"C17*(1+D74/100)","v":2103979.1579999998},{"$f":"D17*(1+E74/100)","v":2030339.8874699997},{"$f":"E17*(1+F74/100)","v":2056734.3060071096},2083471.8519852017,2108473.5142090241,2133775.1963795326,2159380.4987360868,2185293.0647209198,2211516.581497571,2238054.7804755419]
["Verotulot",{"$f":"VLOOKUP($A$4,pohjatiedot!$B$3:$CF$296,12)","v":22321220},{"$f":"VLOOKUP($A$4,pohjatiedot!$B$3:$CF$296,52)","v":23825588},{"$f":"SUM(D15:D17)","v":25105234.348445889},25395350.294522382,13406648.363653162,12821673.810521923,13082553.412973098,13349552.504561914,13622841.442552079,13902596.155652242,14188998.348685093,14482235.71530433]
["Valtionosuudet",{"$f":"VLOOKUP($A$4,pohjatiedot!$B$3:$CF$296,13)","v":9778488},{"$f":"VLOOKUP($A$4,pohjatiedot!$B$3:$CF$296,53)","v":12215170},{"$f":"C19*(1+D75/100)","v":11091374.360000001},{"$f":"D19*(1+E75/100)","v":11668125.826720001},{"$f":"E19*(1+F75/100)","v":3850481.5228176001},{"$f":"F19*(1+G75/100)","v":3950594.042410858},{"$f":"G19*(1+H75/100)","v":4029605.9232590753},4110198.0417242567,4192402.0025587417,4276250.042609917,4361775.0434621153,4449010.5443313578]
[]
{"$rows_left_out":99}
{"sheet":"pohjatiedot","index":2,"n_rows":296,"n_cols":102,"rows_kept":296,"cut":false,"hidden":false,"merged":[]}
[null,null,2019,41,42,43,44,45,46,47,48,49,50,51,52,53,54,55,56,57,58,59,60,61,62,null,null,63,64,65,66,67,68,69,70,71,72,73,74,75,76,77,2020,43,44,45,46,47,48,49,50,51,52,53,54,55,56,57,58,59,60,61,62,63,64,65,66,67,68,69,70,71,72,73,74,75,76,77,78,null,80,81,82,"vero-%",84,85,86,87,88,89,90,91,92,93,94,95,96,"2020, rivi 97",2020,99,100,101]
["Kunta nro.","Kunta","Asukasluku ","Veroprosentti",null,null,"Toimintatuotot","Toimintakulut","Osuus osakkuusyhteisöjen voitoista/tappioista","Kunnallisverot","Yhteisöverot","Kiinteistöverot","Verotulot","Valtionavut","Korkotuotot","Korkokulut","Muut rahoitustuotot","Muut rahoituskulut","VUOSIKATE",null,"Poistot ja arvonalent.","Satunnaiset erät, netto",null,"Tlikauden tulos","Tilinpäätössiirrot","Tilikauden verot","Lask. verot","Vähemmintösiirrot",null,"Tlikauden yli-/alijäämä",null,"Kertynyt yli-/alijäämä",null,null,"Nettoinv. 2019","Vuosikate-nettoinv.",null,"Rahavarat ",null,"Lainakanta ",null,null,"Asukasluku","Veroprosentti",null,null,"Toimintatuotot","Toimintakulut","Osuus osakkuusyhteisöjen voitoista/tappioista","Kunnallisverot","Yhteisöverot","Kiinteistöverot","Verotulot","Valtionavut","Korkotuotot","Korkokulut","Muut rahoitustuotot","Muut rahoituskulut","VUOSIKATE",null,"Poistot ja arvonalent.","Satunnaiset erät",null,"Tlikauden tulos","Tilinpäätössiirrot","Tilikauden verot","Lask. verot","Vähemmistöosuudet","Tlikauden yli-/alijäämä",null,"Kertynyt yli-/alijäämä",null,null,"Nettoinv.","Vuosikate-nettoinv.",null,"Rahavarat ",null,"Lainakanta ",null,"Saamiset",null,null,2021,null,null,null,null,null,null,null,null,null,null,null,null,"Kotikuntakorv+elatustuen palautus, netto","Tulorah.korjauserät","Investointimenot","Rahoitusos. inv.menoihin","Inv.hyödyk. luovutustulot","antolainauksen muutokset"]
[20,"Akaa",16475,22.25,null,null,64620,153015,-4,54693,1613,3319,59625,33974,354,434,422,195,8715,null,8464,0,null,251,0,70,-43,-102,null,36,null,-9892,null,null,-9549,null,null,7089,null,73531,null,null,16391,22.25,null,null,84365,170341,531,59104,1773,3273,64150,39506,317,464,436,98,18402,null,8763,0,null,9639,0,227,-18,-409,8985,null,-1092,null,null,null,null,null,13174,null,75779,null,null,null,null,22.25,null,null,null,null,null,null,null,null,null,null,null,null,null,-2549,-19500,115,4017,-3]
[5,"Alajärvi",9562,21.75,null,null,71516,133738,226,24613,2142,2138,28893,36500,16,393,287,123,3803,null,6114,0,null,-2311,-11,48,-5,7,null,-2368,null,4891,null,null,-10556,null,null,7664,null,50397,null,null,9419,21.75,null,null,70222,131111,113,25512,2144,1927,29583,40681,6,379,337,64,9388,null,6287,0,null,3101,-21,64,-15,29,3030,null,7816,null,null,null,null,null,9622,null,51214,null,null,null,null,21.75,null,null,null,null,null,null,null,null,null,null,null,null,null,-378,-8822,275,28,7]
[9,"Alavieska",2519,22,null,null,15791,31650,1,6537,259,732,7528,9685,0,27,25,11,1774,null,1068,0,null,706,0,1,0,0,null,705,null,1631,null,null,-1629,null,null,3197,null,10120,null,null,2517,22,null,null,16575,32888,1,6711,305,700,7716,10928,0,-10,24,12,2350,null,1045,0,null,1305,-3,0,-1,0,1301,null,2931,null,null,null,null,null,5398,null,11249,null,null,null,null,22,null,null,null,null,null,null,null,null,null,null,null,null,null,127,-1856,13,559,-693]
[10,"Alavus",11468,21.25,null,null,72735,141054,562,28747,2398,2756,33901,38072,67,569,361,223,4949,null,7456,9142,null,6635,11,14,-71,17,null,6578,null,25846,null,null,-2931,null,null,18541,null,78561,null,null,11332,21.25,null,null,73727,142464,488,29760,2810,2502,35072,43125,38,572,832,-74,10211,null,8085,0,null,2126,29,21,-64,-5,2065,null,28359,null,null,null,null,null,29350,null,80862,null,null,null,null,21.25,null,null,null,null,null,null,null,null,null,null,null,null,null,-775,-12011,591,297,204]
[16,"Asikkala",8083,20.75,null,null,42608,88825,16,24509,1436,2893,28838,20631,11,104,281,157,4206,null,4111,-266,null,-171,0,3,-28,-2,null,-204,null,10323,null,null,-3897,null,null,3963,null,19437,null,null,8059,20.75,null,null,42719,87980,7,27480,1731,2672,31883,24269,9,139,296,295,10728,null,4146,0,null,6582,0,1,-57,-2,6522,null,16120,null,null,null,null,null,5585,null,13084,null,null,null,null,20.75,null,null,null,null,null,null,null,null,null,null,null,null,null,-161,-4516,25,360,28]
[18,"Askola",4943,21.5,null,null,14287,39474,3,16454,949,1144,18547,8303,1,275,343,62,2833,null,2340,2496,null,2989,7,1,0,-2,null,2993,null,1595,null,null,-4349,null,null,6873,null,29815,null,null,4878,21.5,null,null,17350,42794,-1,18369,1008,1079,20456,9951,6,225,389,59,5073,null,2989,0,null,2084,6,11,0,-1,2078,null,3673,null,null,null,null,null,10480,null,32665,null,null,null,null,21.5,null,null,null,null,null,null,null,null,null,null,null,null,null,-50,-4429,132,128,0]
[19,"Aura",3941,21.75,null,null,12253,32020,7,12992,571,751,14314,6395,0,50,40,25,1307,null,1309,-1,null,-3,-107,0,-26,-46,null,-182,null,1610,null,null,-1210,null,null,2002,null,15560,null,null,3959,21.5,null,null,12469,32750,9,14340,541,714,15595,8550,1,64,35,14,3831,null,1367,0,null,2464,-66,0,-15,-32,2351,null,3988,null,null,null,null,null,4162,null,14602,null,null,null,null,21.5,null,null,null,null,null,null,null,null,null,null,null,null,null,58,-1397,20,-118,0]
[46,"Enonkoski",1361,21,null,null,10276,19669,0,3379,569,533,4481,5745,4,10,99,5,1153,null,877,0,null,276,0,0,-4,0,null,272,null,6931,null,null,-666,null,null,3555,null,804,null,null,1369,21,null,null,10495,19664,0,3472,680,490,4642,6330,0,9,118,3,1909,null,792,6,null,1123,0,0,3,0,1126,null,8046,null,null,null,null,null,5233,null,1129,null,null,null,null,21,null,null,null,null,null,null,null,null,null,null,null,null,null,-85,-771,1,134,-6]
[47,"Enontekiö",1838,21.25,null,null,8571,22860,-7,5155,384,823,6362,8789,18,95,619,218,1080,null,1024,0,null,56,1,30,-4,0,null,23,null,2110,null,null,-1671,null,null,1978,null,9071,null,null,1808,21.25,null,null,8457,22984,-10,5173,456,765,6394,9753,11,61,472,201,1831,null,1189,-1,null,641,0,-11,5,0,657,null,2797,null,null,null,null,null,2251,null,10084,null,null,null,null,21.25,null,null,null,null,null,null,null,null,null,null,null,null,null,-160,-2941,132,145,-39]
[49,"Espoo",289731,18,null,null,1171298,2544378,-1283,1259684,125298,117004,1501986,113469,11572,46261,48319,3849,270071,null,323458,0,null,-53387,15025,603,2899,3766,null,-32300,null,551120,null,null,-508527,null,null,979656,null,3802739,null,null,292796,18,null,null,1178888,2601118,1586,1356824,136178,112338,1605340,267013,11506,50960,34821,12336,434740,null,330694,0,null,104046,15019,837,618,4334,123180,null,665687,null,null,null,null,null,1249091,null,4285902,null,null,null,null,18,null,null,null,null,null,null,null,null,null,null,null,null,null,-78969,-784640,84956,91312,2749]
[50,"Eura",11632,20.5,null,null,36328,104526,0,38473,1964,3128,43565,26709,3,343,162,140,1480,null,6065,3,null,-4582,0,2,26,10,null,-4548,null,-3389,null,null,-9291,null,null,4992,null,63193,null,null,11483,21,null,null,37130,103474,0,40534,2487,2814,45835,31571,4,413,150,13,10790,null,6675,0,null,4115,0,2,-20,16,4109,null,683,null,null,null,null,null,6179,null,60326,null,null,null,null,21,null,null,null,null,null,null,null,null,null,null,null,null,null,-17,-7143,47,663,-19]
[51,"Eurajoki",9402,18,null,null,32393,93103,0,28914,2214,19212,50340,11120,0,49,2163,378,4206,null,5684,0,null,-1478,-49,13,-14,0,null,-1554,null,74437,null,null,-4781,null,null,24367,null,14768,null,null,9452,18,null,null,31423,92433,0,28776,2667,19742,51185,14150,2,130,910,294,4813,null,5453,86,null,-554,-24,1,-6,0,-585,null,73724,null,null,null,null,null,24925,null,16034,null,null,null,null,18,null,null,null,null,null,null,null,null,null,null,null,null,null,-189,-8421,24,4070,211]
[52,"Evijärvi",2425,21.5,null,null,7743,25616,1,6586,639,750,7975,9272,57,33,722,98,94,null,1115,0,null,-1021,-12,2,2,4,null,-1029,null,1214,null,null,-1945,null,null,7580,null,9505,null,null,2408,21.5,null,null,7707,25330,2,6733,674,693,8100,10208,68,33,734,503,953,null,1260,0,null,-307,-5,5,0,-1,-318,null,887,null,null,null,null,null,8419,null,13108,null,null,null,null,21.5,null,null,null,null,null,null,null,null,null,null,null,null,null,-62,-2299,61,7,14]
[61,"Forssa",16901,20.5,null,null,75167,172163,0,51271,3659,5309,60239,45460,129,643,132,40,8303,null,9409,0,null,-1106,4,11,200,-11,null,-924,null,22751,null,null,-7846,null,null,27447,null,68965,null,null,16800,20.5,null,null,75469,174682,0,52863,3955,4744,61562,53410,43,710,79,12,14768,null,10822,0,null,3946,1,38,0,13,3922,null,26673,null,null,null,null,null,32654,null,67667,null,null,null,null,20.5,null,null,null,null,null,null,null,null,null,null,null,null,null,-988,-9940,135,183,179]
[69,"Haapajärvi",7010,22.5,null,null,42245,90080,17,19358,1560,2243,23161,25932,31,392,2058,233,3058,null,4278,0,null,-1220,-1,206,28,-192,null,-1591,null,3187,null,null,-11723,null,null,22673,null,51953,null,null,6896,22.5,null,null,43245,89699,54,20221,1388,2015,23624,30447,25,376,1043,631,7639,null,4983,0,null,2656,-15,13,8,-14,2622,null,5920,null,null,null,null,null,24136,null,63333,null,null,null,null,22.5,null,null,null,null,null,null,null,null,null,null,null,null,null,-563,-17193,55,1468,-11]
[71,"Haapavesi",6758,22,null,null,33053,77883,2,17246,1309,1664,20219,27134,29,374,693,243,3653,null,3661,0,null,-8,-1,91,-1,25,null,-76,null,-249,null,null,-3500,null,null,13882,null,37478,null,null,6667,22,null,null,37213,78944,4,18864,1224,1488,21576,26831,22,331,1343,1373,6226,null,3718,0,null,2508,-15,103,2,21,2413,null,2279,null,null,null,null,null,16524,null,43083,null,null,null,null,22,null,null,null,null,null,null,null,null,null,null,null,null,null,-616,-11443,205,908,-32]
[72,"Hailuoto",959,20.5,null,null,5157,12141,1,3032,98,339,3469,3713,6,19,4,4,308,null,692,0,null,-384,-1,1,0,0,null,-386,null,6414,null,null,-2468,null,null,1115,null,3581,null,null,949,20.5,null,null,5273,12083,1,3176,121,308,3605,4142,5,20,5,5,923,null,816,0,null,107,2,0,-1,0,108,null,6520,null,null,null,null,null,1167,null,3968,null,null,null,null,20.5,null,null,null,null,null,null,null,null,null,null,null,null,null,-32,-1436,42,50,-3]
[74,"Halsua",1127,22,null,null,9293,17331,53,2623,432,356,3411,4788,7,132,26,1,555,null,841,0,null,-286,-3,6,0,-2,null,-297,null,1778,null,null,-699,null,null,2342,null,14435,null,null,1103,23.5,null,null,9046,16539,53,3206,440,354,4000,5567,4,101,24,0,2054,null,1216,0,null,838,-16,8,0,-2,812,null,2594,null,null,null,null,null,2538,null,13689,null,null,null,null,23.5,null,null,null,null,null,null,null,null,null,null,null,null,null,-39,-744,9,24,42]
{"$rows_left_out":277}
{"sheet":"väestöennuste","index":3,"n_rows":300,"n_cols":13,"rows_kept":300,"cut":false,"hidden":false,"merged":[]}
["Väestöennuste 2019 kunnittain 2021-2029"]
["TK, Syyskuu 2019"]
["2021 kuntajako",3,4,5,6,7,8,9,10,11,12,13,14]
[]
[null,2019,2020,2021,2022,2023,2024,2025,2026,2027,2028,2029,2030]
[]
["Akaa",{"$f":"pohjatiedot!AQ3","v":16391},16353,16229,16108,15984,15861,15743,15630,15523,15419,15317,{"$f":"L7","v":15317}]
["Alajärvi",{"$f":"pohjatiedot!AQ4","v":9419},9472,9363,9256,9153,9052,8952,8854,8757,8659,8565,{"$f":"L8","v":8565}]
["Alavieska",{"$f":"pohjatiedot!AQ5","v":2517},2496,2461,2428,2396,2366,2338,2309,2283,2257,2231,2231]
["Alavus",{"$f":"pohjatiedot!AQ6","v":11332},11253,11118,10988,10861,10736,10608,10486,10365,10250,10136,10136]
["Asikkala",{"$f":"pohjatiedot!AQ7","v":8059},8032,7980,7929,7874,7819,7761,7707,7653,7600,7548,7548]
["Askola",{"$f":"pohjatiedot!AQ8","v":4878},4947,4938,4924,4912,4900,4889,4877,4864,4846,4827,4827]
["Aura",{"$f":"pohjatiedot!AQ9","v":3959},3973,3968,3963,3959,3951,3946,3940,3935,3932,3925,3925]
["Enonkoski",{"$f":"pohjatiedot!AQ10","v":1369},1369,1352,1333,1316,1300,1283,1269,1254,1239,1224,1224]
["Enontekiö",{"$f":"pohjatiedot!AQ11","v":1808},1849,1850,1850,1852,1854,1855,1856,1855,1853,1848,1848]
["Espoo",{"$f":"pohjatiedot!AQ12","v":292796},292052,296067,299943,303678,307254,310666,313918,317005,319936,322710,322710]
["Eura",{"$f":"pohjatiedot!AQ13","v":11483},11504,11386,11267,11148,11033,10918,10809,10705,10602,10499,10499]
["Eurajoki",{"$f":"pohjatiedot!AQ14","v":9452},9505,9522,9534,9539,9540,9532,9516,9493,9467,9439,9439]
["Evijärvi",{"$f":"pohjatiedot!AQ15","v":2408},2385,2342,2300,2260,2223,2187,2153,2118,2082,2050,2050]
["Forssa",{"$f":"pohjatiedot!AQ16","v":16800},16759,16629,16505,16384,16265,16149,16036,15923,15811,15703,15703]
{"$rows_left_out":280}