{"text_format":"1","workbook":"xlsx","n_sheets":4,"sheets":["selite","KEHIKKO","pohjatiedot","väestöennuste"],"not_rendered":{"charts":3,"images":0,"macros":0,"external_links":1,"defined_names":3,"comments":0,"pivot_tables":0},"unopened":[],"bounds":{"document_bytes":16777216,"sheet_cells":100000,"rows_first":2000,"rows_last":500,"rows_between":2000,"halvings":0,"cell_chars":16384,"cell_head_chars":4096},"cells_cut":0,"cells_raw":0,"read":"whole","date_system":"1900"}

{"sheet":"selite","index":0,"n_rows":67,"n_cols":2,"rows_kept":67,"cut":false,"hidden":false,"merged":[]}
["VM/KAO/vs"]
[]
["KUNTAKONSERNIN TALOUDEN SUUNNITTELUKEHIKKO"]
["Kuntakonsernin talouden tulevan kehityksen arvioinnin suunnitteluun"]
[]
["Kehikon käyttötarkoitus:"]
["Vuorovaikutteinen kuntakonsernin talouden suunnittelun apuväline. Kehikon avulla voidaan suunnitella konsernin talouden"]
["kehitystä pidemmällä aikavälillä. Tarkastelun kohteena ovat konsernin tuloslaskelma, rahoituslaskelmasta rahavarat, antolainat ja"]
["investoinnit sekä taseesta lainat ja kertynyt yli-/alijäämä. Pohjatietoina kehikossa ovat 2 viimeksi "]
["valmistunutta tilinpäätöstä. "]
[]
["Tulevan kehityksen osalta tuloslaskelman erien kasvuolettamukset pohjautuvat lähtökohtaisesti"]
["uusimman kuntatalousohjelman mukaisiin makroennusteisiin."]
["Käyttäjä voi kuitenkin itse muokata em. muutosolettamuksia sekä muita tuloslaskelman eriä."]
["Myös tuloveroprosenttia, investointeja ja antolainasaamisten määrää voidaan muuttaa."]
{"$rows_left_out":53}
{"sheet":"KEHIKKO","index":1,"n_rows":150,"n_cols":20,"rows_kept":150,"cut":false,"hidden":false,"merged":[]}
["VM/KAO/vs",null,null,null,null,null,null,"VALITSE KUNTA:",null,null,null,"2025-09-29"]
["KUNTAKONSERNIN TALOUDEN SUUNNITTELUKEHIKKO",null,null,null,null,null,null,null,null,"Kunnat vuoden 2024 kuntajaolla"]
["Muokkaa vaaleansinisellä olevia kohtia."]
[{"$f":"INDEX(pohjatiedot!$B$3:$B$296,KEHIKKO!$A$5)","v":"KOKO MAA (Manner-Suomi)"}]
[95,"TP 2023","TP 2024",2025,2026,2027,2028,2029,2030,2031,2032,2033,2034]
["TULOSLASKELMA",1000,1000,1000,1000,1000,1000,1000,1000,1000,1000,1000,1000]
[]
["Asukasluku 31.12.",{"$f":"VLOOKUP($A$4,pohjatiedot!$B$3:$CE$296,2)","v":5573310},{"$f":"VLOOKUP($A$4,pohjatiedot!$B$3:$CE$296,41)","v":5605317},{"$f":"VLOOKUP($A$4,väestöennuste!$A$7:$N$302,5)","v":5634755.0991483154},{"$f":"VLOOKUP($A$4,väestöennuste!$A$7:$N$302,6)","v":5659124.5818050373},{"$f":"VLOOKUP($A$4,väestöennuste!$A$7:$N$302,7)","v":5683205.1154699614},{"$f":"VLOOKUP($A$4,väestöennuste!$A$7:$N$302,8)","v":5706993.649962577},{"$f":"VLOOKUP($A$4,väestöennuste!$A$7:$N$302,9)","v":5730436.0205329033},{"$f":"VLOOKUP($A$4,väestöennuste!$A$7:$N$302,10)","v":5753520.8284119572},{"$f":"VLOOKUP($A$4,väestöennuste!$A$7:$N$302,11)","v":5776185.3698676806},{"$f":"VLOOKUP($A$4,väestöennuste!$A$7:$N$302,12)","v":5798417.9359263573},{"$f":"VLOOKUP($A$4,väestöennuste!$A$7:$N$302,13)","v":5820261.7650889205},{"$f":"VLOOKUP($A$4,väestöennuste!$A$7:$N$302,14)","v":5841671.3798028417},null,"Väestöennuste TK 9/2024; toteumakorjattu 2024 tiedoilla"]
["Veroprosentti",{"$f":"VLOOKUP($A$4,pohjatiedot!$B$3:$CE$296,3)","v":7.33},{"$f":"VLOOKUP($A$4,pohjatiedot!$B$3:$CE$296,42)","v":7.4661412490259718},{"$f":"VLOOKUP($A$4,pohjatiedot!$B$3:$CH$296,82)","v":7.5294273297796392},{"$f":"D9","v":7.5294273297796392},{"$f":"E9","v":7.5294273297796392},{"$f":"F9","v":7.5294273297796392},{"$f":"G9","v":7.5294273297796392},{"$f":"H9","v":7.5294273297796392},{"$f":"I9","v":7.5294273297796392},{"$f":"J9","v":7.5294273297796392},{"$f":"K9","v":7.5294273297796392},{"$f":"L9","v":7.5294273297796392}]
["vero-% yksikön tuotto",{"$f":"B16/B9","v":1394164.3348663037},{"$f":"C16/C9","v":1323762.7117166282},{"$f":"D16/D9","v":1335173.8848103324},{"$f":"E16/E9","v":1415716.1729306502},1466717.4573489435,1532290.5373153205,1595479.1416465563,1635366.1201877203,1676250.2731924132,1718156.5300222235,1761110.4432727788,1805138.204354598]
[" → noston vaikutus",null,null,{"$f":"(D9-C9)*C10","v":83775.753872392379},{"$f":"(E9-D9)*D10","v":0},{"$f":"(F9-E9)*E10","v":0},{"$f":"(G9-F9)*F10","v":0},0,0,0,0,0,0]
["Toimintatuotot ",{"$f":"VLOOKUP($A$4,pohjatiedot!$B$3:$CE$296,6)","v":16919176.562529992},{"$f":"VLOOKUP($A$4,pohjatiedot!$B$3:$CE$296,45)","v":16601235.456649998},{"$f":"C12*(1+D72/100)","v":16357250.883097516},{"$f":"D12*(1+E72/100)","v":16248610.489021525},{"$f":"E12*(1+F72/100)","v":16577231.181801468},{"$f":"F12*(1+G72/100)","v":16850729.746505801},{"$f":"G12*(1+H72/100)","v":17003097.210878897},17173128.182987686,17344859.464817565,17518308.05946574,17693491.140060399,17870426.051461004,null,"Näiden erien muutos-"]
["Toimintakulut",{"$f":"VLOOKUP($A$4,pohjatiedot!$B$3:$CE$296,7)","v":29260015.114219997},{"$f":"VLOOKUP($A$4,pohjatiedot!$B$3:$CE$296,46)","v":29026603.902270023},{"$f":"C13*(1+D73/100)","v":30434594.992029},31335317.081985768,{"$f":"E13*(1+F73/100)","v":32186177.108513646},{"$f":"F13*(1+G73/100)","v":32967762.915240563},33575262.81662181,34246768.072954245,34931703.434413329,35630337.503101595,36342944.253163628,37069803.138226904,null,"prosentit syötetään"]
["Osuus osakk.yht. voitoista/tappioista",{"$f":"VLOOKUP($A$4,pohjatiedot!$B$3:$CE$296,8)","v":66903.972120000006},{"$f":"VLOOKUP($A$4,pohjatiedot!$B$3:$CE$296,47)","v":90620.795270000002},{"$f":"C14","v":90620.795270000002},{"$f":"D14","v":90620.795270000002},{"$f":"E14","v":90620.795270000002},90620.795270000002,90620.795270000002,90620.795270000002,90620.795270000002,90620.795270000002,90620.795270000002,90620.795270000002,null,"alla olevaan taulukkoon"]
["Toimintakate",{"$f":"B12-B13+B14","v":-12273934.579570005},{"$f":"C12-C13+C14","v":-12334747.650350025},{"$f":"D12-D13+D14","v":-13986723.313661484},{"$f":"E12-E13+E14","v":-14996085.797694243},-15518325.131442178,-16026412.373464763,-16481544.810472913,-16983019.094696559,-17496223.174325764,-18021408.648365855,-18558832.31783323,-19108756.291495901]
{"$rows_left_out":136}
{"sheet":"pohjatiedot","index":2,"n_rows":296,"n_cols":101,"rows_kept":296,"cut":false,"hidden":false,"merged":[]}
[null,null,202,3,4,5,6,7,8,9,10,11,12,13,14,15,16,17,18,19,20,21,22,23,24,25,26,27,28,29,30,31,32,33,34,35,36,37,38,39,40,2024,42,43,44,45,46,47,48,49,50,51,52,53,54,55,56,57,58,59,60,61,62,63,64,65,66,67,68,69,70,71,72,73,74,75,76,77,78,79,80,81,"vero-%",83,84,85,86,87,88,89,2023,91,92,93,94,95,2024,97,98,99,100]
["Kunta nro.","Kunta","Asukasluku ","Veroprosentti",null,null,"Toimintatuotot","Toimintakulut","Osuus osakkuusyhteisöjen voitoista/tappioista","Kunnallisverot","Yhteisöverot","Kiinteistöverot","Verotulot","Valtionosuudet","Korkotuotot","Korkokulut","Muut rahoitustuotot","Muut rahoituskulut","VUOSIKATE",null,"Poistot ja arvonalent.","Satunnaiset erät, netto",null,"Tlikauden tulos","Tilinpäätössiirrot","Tilikauden verot","Lask. verot","Vähemmintösiirrot","Tlikauden yli-/alijäämä",null,"Kertynyt yli-/alijäämä",null,null,"Nettoinv. ","Vuosikate-nettoinv.",null,"Rahavarat ",null,"Lainakanta ",null,null,"Asukasluku","Veroprosentti",null,null,"Toimintatuotot","Toimintakulut","Osuus osakkuusyhteisöjen voitoista/tappioista","Kunnallisverot","Yhteisöverot","Kiinteistöverot","Verotulot","Valtionosuudet","Korkotuotot","Korkokulut","Muut rahoitustuotot","Muut rahoituskulut","VUOSIKATE",null,"Poistot ja arvonalent.","Satunnaiset erät",null,"Tlikauden tulos","Tilinpäätössiirrot","Tilikauden verot","Lask. verot","Vähemmistöosuudet","Tlikauden yli-/alijäämä",null,"Kertynyt yli-/alijäämä",null,null,"Nettoinv.","Vuosikate-nettoinv.",null,"Rahavarat ",null,"Lainakanta ",null,"Saamiset",null,null,2025,null,null,null,null,null,null,null,"Tulorah.korjauserät","Investointimenot","Rahoitusos. inv.menoihin","Inv.hyödyk. luovutustulot","Antolainauksen muutokset","Kotikuntakorv+elatustuen palautus, netto","Tulorah.korjauserät","Investointimenot","Rahoitusos. inv.menoihin","Inv.hyödyk. luovutustulot","antolainauksen muutokset"]
[20,"Akaa",16405,9.36,null,null,9398.5214600000018,52115.260679999999,123.40158,33084.79279,1980.5846999999999,3880.7251200000001,38946.102610000002,12622.80838,519.64599999999996,2288.60752,321.63056,55.105930000000001,7473.1364599999997,null,6919.1013300000004,0,null,554.03512999999998,0.22119999999999998,0.40961000000000003,-3.94,28.33539,578.24211000000003,null,-3425.1219799999999,null,null,null,null,null,179.45281,null,97654.055810000005,null,null,16387,9.9,null,null,10099.190939999999,50274.359520000005,172.57348000000002,34690.174039999998,1683.8236299999999,4059.3135400000001,40347.032060000005,8990.3692599999995,614.70398,3075.8298500000001,321.54705000000001,43.087519999999998,7152.1398799999997,null,8138.9803899999997,0,null,-986.84050999999999,0.22119999999999998,0.33513999999999999,-33.228000000000002,-5.8056200000000002,-1025.8205,null,-4185.2639300000001,null,null,null,null,null,9554.09375,null,104990.49455,null,null,null,null,9.9,null,null,null,null,null,null,null,-119.79577,-14064.54349,13.2425,164.53005999999999,420,null,-385.69087000000002,-4553.4340000000002,166.06842,469.97507999999999,0]
[5,"Alajärvi",9113,9.11,null,null,20092.255410000002,47311.961459999999,132.46233999999998,13866.599310000001,2299.9638399999999,2454.07861,18620.641760000002,17437.39241,45.403150000000004,524.75118999999995,204.5805,21.580459999999999,8674.4424600000002,null,5022.6077000000005,0,null,3651.8347599999997,0,33.713889999999999,2.8704000000000001,8.8975000000000009,3629.88877,null,13315.98142,null,null,null,null,null,8314.0888599999998,null,30309.26426,null,null,9078,9.1,null,null,20550.885770000001,47574.345079999999,139.81837999999999,13800.597589999999,2274.8065699999997,3522.2202200000002,19597.624379999997,16159.89157,60.448180000000001,679.12433999999996,171.85151000000002,42.96246,8384.0879100000002,null,5123.0761299999995,0,null,3261.0117799999998,0,93.266460000000009,3.1347300000000002,-8.3997199999999985,3209.1135600000002,null,16957.823280000001,null,null,null,null,null,8734.6514399999996,null,26146.768790000002,null,null,null,null,9.1,null,null,null,null,null,null,null,-193.74161999999998,-3050.9133400000001,7.8563900000000002,110.55450999999999,48.217199999999998,null,-381.76373000000001,-4130.5512600000002,121.19658,9.5531100000000002,6.8956999999999997]
[9,"Alavieska",2437,9.36,null,null,3988.9176499999999,11747.910599999999,12.066240000000001,3888.28253,256.39553000000001,786.91356000000007,4931.5916200000001,4520.2201500000001,30.93572,243.79504999999997,246.18260000000001,59.81006,1670.52621,null,1247.41443,-10.54,null,412.57178000000005,1.29386,3.5845799999999999,0,0,410.28106000000002,null,5893.3795300000002,null,null,null,null,null,5316.2270499999995,null,9042.18649,null,null,2410,9.3000000000000007,null,null,2908.7699700000003,10510.11701,8.9897299999999998,3807.3420699999997,227.81795000000002,831.61473000000001,4857.3606399999999,4529.9661500000002,59.013539999999999,332.95153999999997,291.12011999999999,2.5238899999999997,1809.62771,null,1094.72009,0,null,714.90761999999995,-1.79548,0.77700000000000002,0,0,712.72364000000005,null,6793.6177399999997,null,null,null,null,null,6205.3219900000004,null,10887.282369999999,null,null,null,null,9.3000000000000007,null,null,null,null,null,null,null,-12.416799999999999,-1982.62184,25.147740000000002,47.236359999999998,6.3,null,-12.216340000000001,-2682.5090299999997,423.64403000000004,63.786569999999998,1071.3]
[10,"Alavus",10933,8.61,null,null,18086.034920000002,44951.001349999999,661.18295000000001,15177.962680000001,2552.0279799999998,3162.5322500000002,20892.52291,12378.599,58.172330000000002,1617.7236699999999,1587.6964499999999,140.67607999999998,6816.57521,null,7360.6696700000002,-221.17342000000002,null,-765.26787999999999,10,13.119399999999999,-13.438000000000001,2.9853200000000002,-778.83996000000002,null,23125.215119999997,null,null,null,null,null,30138.606219999998,null,79302.655979999996,null,null,10780,9.6,null,null,17134.90929,43607.421759999997,95.140079999999998,17227.632879999997,2001.5111899999999,3382.98306,22573.237739999997,12813.030939999999,45.819110000000002,1859.23712,1284.46576,294.63056,8185.3134800000007,null,6806.7005599999993,0,null,1378.61292,0,11.13602,-20.72,11.10548,1363.43039,null,24599.677460000003,null,null,null,null,null,25707.298340000001,null,75246.87840999999,null,null,null,null,9.6,null,null,null,null,null,null,null,-1242.28234,-11953.5674,884.25893999999994,2762.9071400000003,102.04414,null,-329.17359999999996,-7594.1239100000003,316.01853000000006,856.53048000000001,129.94927000000001]
[16,"Asikkala",7968,8.11,null,null,8786.0314299999991,31668.344300000001,4.28627,13354.66186,1596.22371,3182.3204700000001,18133.206039999997,12731.768119999999,243.69968,355.02100999999999,106.78177000000001,113.09569999999999,7824.5950999999995,null,3728.2835399999999,-2.24735,null,4094.06421,-1.04226,0,-52.930599999999998,0,4040.0913500000001,null,27444.24481,null,null,null,null,null,2557.03325,null,14864.742020000002,null,null,7889,8.1,null,null,8829.3646599999993,31785.78685,3.7205100000000004,12891.63283,1348.3377499999999,3560.5853900000002,17755.133280000002,10340.966560000001,44.81221,501.58151000000004,97.84353999999999,4.1085000000000003,4780.36391,null,4506.1731,-3.0708000000000002,null,272.65540999999996,-0.9869,0,-27.901049999999998,0,243.76746,null,27688.012269999999,null,null,null,null,null,2785.2491800000003,null,19828.245510000001,null,null,null,null,8.1,null,null,null,null,null,null,null,687.74229000000003,-12941.977000000001,480.54323999999997,4725.9539800000002,0,null,106.96862,-10973.833349999999,67.794640000000001,159.73737,0]
[18,"Askola",4700,8.86,null,null,8450.6453799999999,21191.74986,-73.283829999999995,9421.46738,1152.64824,1285.2098899999999,11859.325510000001,3522.4180000000001,62.037790000000001,599.36077,780.01604000000009,449.15625,2360.8920099999996,null,1905.62114,0,null,455.27087,-4.9642400000000002,18.415839999999999,0,0,431.89078999999998,null,13359.798889999998,null,null,null,null,null,8489.0090999999993,null,22892.62717,null,null,4651,8.9,null,null,8646.5740500000011,21763.063620000001,111.79099000000001,9807.2866599999998,798.07987000000003,1335.6262300000001,11940.992759999999,3110.1590000000001,17.198430000000002,665.92850999999996,994.27561000000003,292.51490000000001,2099.4838100000002,null,2509.0024500000004,0,null,-409.51864,0.43930999999999998,48.464220000000005,0,0,-433.31144,null,12804.81307,null,null,null,null,null,9747.529050000001,null,26861.435819999999,null,null,null,null,9.1999999999999993,null,null,null,null,null,null,null,-56.818849999999998,-1236.0499399999999,-0.99360000000000004,96.396600000000007,0,null,18.9572,-4905.2343899999996,0,56.122099999999996,0]
[19,"Aura",3961,8.86,null,null,3715.4181100000001,14438.434439999999,-0.27964,7361.4130800000003,630.30621999999994,913.92156999999997,8905.6408699999993,3574.93694,4.6663100000000002,128.72055,31.51962,17.736249999999998,1647.01097,null,1015.92416,85.935820000000007,null,717.02263000000005,-94.237820000000013,2.1989999999999999E-2,-21.398,-43.025199999999998,558.33961999999997,null,6345.9692599999998,null,null,null,null,null,1156.865,null,8378.3371399999996,null,null,3966,8.9,null,null,3149.6307599999996,13822.196310000001,0.34555000000000002,7387.3833199999999,497.96302000000003,936.02381000000003,8821.3701500000006,2547.8528900000001,3.2728899999999999,177.10189000000003,56.84055,13.121649999999999,566.89293000000009,null,1166.0820200000001,0.45200000000000001,null,-582.17147,-93.98,0.62546000000000002,-17.143999999999998,-32.889789999999998,-726.49798999999996,null,4601.2272299999995,null,null,null,null,null,1239.5723899999998,null,9289.7892199999987,null,null,null,null,8.9,null,null,null,null,null,null,null,-94.022790000000001,-1332.75368,38.19,567.03694999999993,-0.59325000000000006,null,-63.605499999999999,-1084.7931999999998,54.615000000000002,169.18135000000001,0]
[46,"Enonkoski",1320,8.36,null,null,2025.1452400000001,6369.8621499999999,0,1757.7245399999999,549.5783100000001,582.96794,2890.27079,2543.7663399999997,112.42671,1.49925,140.69376,11.342309999999999,1313.31872,null,659.04062999999996,11.104100000000001,null,665.38218999999992,0,0.43995999999999996,13.479200000000001,0,678.4214300000001,null,10714.96054,null,null,null,null,null,6749.12039,null,90.588269999999994,null,null,1288,8.4,null,null,2213.1512400000001,6790.1799099999998,0,1858.91345,472.87673000000001,618.58040000000005,2934.2680099999998,2589.77547,136.50432000000001,1.83152,233.80092999999999,82.260660000000001,1233.2278799999999,null,777.69650000000001,0,null,455.53138000000001,-1.0102800000000001,2.3482800000000004,22.841519999999999,0,476.18847999999997,null,11191.149009999999,null,null,null,null,null,7589.8840499999997,null,63.648530000000001,null,null,null,null,8.4,null,null,null,null,null,null,null,-17.160319999999999,-654.66069999999991,0,14.56395,-64.792910000000006,null,-6.7273900000000006,-484.30836999999997,0,49.05847,71.792910000000006]
[47,"Enontekiö",1771,8.61,null,null,5092.2469199999996,12442.472960000001,-3.8234299999999997,3032.2939300000003,592.20650999999998,1005.2551500000001,4629.7555899999998,3700.0889400000001,5.7561800000000005,24.978680000000001,906.80556999999999,225.95928000000001,1637.41885,null,854.71647999999993,-9.5500000000000012E-3,null,782.69281999999998,0,2.3614499999999996,1.0000000000000001E-5,0,780.33137999999997,null,13670.5569,null,null,null,null,null,7114.4779699999999,null,3059.0958499999997,null,null,1762,8.6,null,null,4385.6941900000002,12647.16635,-9.3744800000000001,2946.3884199999998,451.38965999999999,1091.35536,4489.1334400000005,3438.5650000000001,148.09148999999999,94.972759999999994,835.69452999999999,191.01882999999998,354.64623,null,833.38225999999997,0,null,-478.73603000000003,-1.74,17.5825,1.0000000000000001E-5,0,-489.26727,null,12891.942270000001,null,null,null,null,null,3650.7075800000002,null,5276.0341900000003,null,null,null,null,8.6,null,null,null,null,null,null,null,-203.93780999999998,-1987.10673,258.64132999999998,209.38749999999999,1.7077800000000001,null,-204.29167999999999,-11966.89515,5148.9449299999997,152.8168,-1.478]
[49,"Espoo",314024,5.3600000000000012,null,null,800948.20535000006,1579872.6102,3184.20426,615847.31613000005,152479.9431,143060.23103,911387.49025999999,427492.31962999998,16240.95743,78310.590500000006,60207.879909999996,5089.1097,556188.74644000002,null,361111.02724000002,0,null,195077.71919999999,48.349129999999995,-1341.8470300000001,1234.6593899999998,7985.0048799999995,205687.57962999999,null,1215298.3387,null,null,null,null,null,1403823.8617799999,null,3854006.5495699998,null,null,320931,5.3,null,null,762431.87621999998,1644165.74868,2269.9092799999999,526240.06814999995,140712.76243999999,162120.62192999999,829073.45251999993,466234.36245000002,14817.625410000001,84190.602599999998,71320.371299999999,5343.2480999999998,412447.99780000001,null,377110.01227999997,0,null,35337.985529999998,24.094799999999999,-1463.56158,-32.44,8910.4123399999989,44971.833460000002,null,1250643.5856600001,null,null,null,null,null,1331735.94135,null,3782563.0516300001,null,null,null,null,5.3,null,null,null,null,null,null,null,-77803.05812999999,-375188.33918999997,6333.0618299999996,77793.049819999986,2442.9889199999998,null,-11078.782380000001,-418462.26686000003,9262.5426199999984,10856.246869999999,5531.5825999999997]
[50,"Eura",11184,8.36,null,null,13423.13444,42867.322759999995,0,20217.262549999999,2537.2622299999998,3388.5784800000001,26143.10326,10603.653329999999,25.695499999999999,1150.3295000000001,298.96709000000004,80.497179999999986,6396.4041799999995,null,5907.7361000000001,0,null,488.66808000000003,-32.976730000000003,15.731249999999999,40.358379999999997,11.131930000000001,491.45040999999998,null,1558.3018099999999,null,null,null,null,null,3405.0880999999999,null,54034.355410000004,null,null,11084,8.9999999999999982,null,null,13072.32151,42667.185799999999,0,21629.167890000001,2142.0166300000001,3516.92065,27288.105170000003,8631.22091,46.93421,1539.9061999999999,185.27059,277.94607999999999,4738.8143099999998,null,5861.1577900000002,0,null,-1122.34348,124.58333,9.2606399999999987,14.41525,-14.06851,-1002.04373,null,434.04625999999996,null,null,null,null,null,3760.1754599999999,null,60958.820260000008,null,null,null,null,9.4000000000000021,null,null,null,null,null,null,null,-55.631320000000002,-6485.2301900000002,0,306.72009000000003,55.946339999999999,null,-304.61430000000001,-11030.457289999998,0,175.67026999999999,-104.07135000000001]
[51,"Eurajoki",9143,5.36,null,null,8738.8083499999993,37980.679090000005,0,11935.331550000001,2894.2556400000003,25315.194760000002,40144.781950000004,-3955.5070000000001,67.193089999999998,300.62432000000001,627.47304000000008,6.1099399999999999,7335.33608,null,4333.4667199999994,0,null,3001.8693599999997,20.300609999999999,0,-14.198120000000001,0,3007.9718499999999,null,81278.180290000004,null,null,null,null,null,23403.89688,null,9009.2644600000003,null,null,9052,5.4,null,null,8125.7131200000003,38128.542110000002,0,11300.9071,2927.2141799999999,26098.885630000001,40327.006909999996,-4672.0540000000001,52.345320000000001,333.31551000000002,1476.2275300000001,63.582989999999995,6783.7982699999993,null,6113.5516600000001,0,null,670.24661000000003,6.1731499999999997,0,-6.1731499999999997,0,670.24661000000003,null,81991.621220000001,null,null,null,null,null,22072.678500000002,null,7729.8944700000002,null,null,null,null,6.4,null,null,null,null,null,null,null,590.40109999999993,-11474.102570000001,647.00459999999998,436.56251000000003,0,null,-143.85917999999998,-6696.4315900000001,388.3,202.85348000000002,0]
[52,"Evijärvi",2292,9.86,null,null,2734.3961400000003,10080.97401,0,3690.80053,692.74706999999989,833.69174999999996,5217.2393499999998,4359.4899100000002,69.792389999999997,258.09942999999998,444.61142999999998,201.98854,2284.4672400000004,null,1012.39067,0,null,1272.0765700000002,-6.72,4.9012000000000002,0,-8.150000000000001E-3,1260.44722,null,3175.9147199999998,null,null,null,null,null,8163.36049,null,8848.2531799999997,null,null,2272,9.8000000000000007,null,null,2720.3047000000001,10201.76023,0,4029.0507000000002,610.53413,900.91279000000009,5540.4976200000001,4102.62201,59.945410000000003,281.99318,164.58034000000001,36.174750000000003,2068.0219200000001,null,871.48375999999996,0,null,1196.5381599999998,-2.9,4.1849399999999992,0,1.2210300000000001,1192.7667200000001,null,4293.48333,null,null,null,null,null,8880.2006000000001,null,8322.8532200000009,null,null,null,null,9.8000000000000007,null,null,null,null,null,null,null,-12.169030000000001,-1372.75055,55,-3.4978699999999998,49.615449999999996,null,0,-497.13688999999999,55,4.19442,27.751080000000002]
{"$rows_left_out":282}
{"sheet":"väestöennuste","index":3,"n_rows":300,"n_cols":14,"rows_kept":300,"cut":false,"hidden":false,"merged":[]}
["Väestöennuste 2024 (Tilastokeskus) kunnittain 2024-2034"]
["TK, 9/2024"]
["2024 kuntajako",2,3,4,5,6,7,8,9,10,11,12,13,14]
[]
[null,2022,2023,2024,2025,2026,2027,2028,2029,2030,2031,2032,2033,2034]
[]
["Akaa",{"$f":"pohjatiedot!AP3","v":16387},16353,16387,16348.967507481831,16312.936725096195,16281.910218041898,16254.887131252672,16235.870884993587,16219.857203933305,16208.847798204361,16205.845233005557,16208.847798204359,16218.856348867033]
["Alajärvi",{"$f":"pohjatiedot!AP4","v":9078},9472,9078,8965.1296625222021,8849.2360124333918,8731.3268206039065,8620.4720248667836,8513.6483126110106,8414.8867673179375,8319.1485346358768,8234.4957815275284,8152.8663410301924,8076.2757548845439]
["Alavieska",{"$f":"pohjatiedot!AP5","v":2410},2496,2410,2380.95178719867,2352.9052369077308,2328.865336658354,2303.8237738985868,2282.7888611803824,2261.753948462178,2242.7223607647547,2224.6924355777223,2208.6658354114711,2193.6408977556107]
["Alavus",{"$f":"pohjatiedot!AP6","v":10780},11253,10780,10649.266802443992,10523.523421588594,10399.775967413441,10281.018329938899,10168.248472505091,10059.470468431771,9954.6843177189403,9852.8920570264763,9757.0875763747463,9664.2769857433814]
["Asikkala",{"$f":"pohjatiedot!AP7","v":7889},8032,7889,7850.2602618987657,7807.5472173256103,7763.8408461344743,7725.1011080332401,7690.334676403927,7656.5615713925945,7627.7550994711646,7599.9419541677144,7574.1154621002252,7547.2956434147554]
["Askola",{"$f":"pohjatiedot!AP8","v":4651},4947,4651,4616.0600987336338,4583.1167632539173,4552.1699935608503,4518.2283751878094,4484.2867568147676,4453.3399871217007,4426.386349001933,4403.4258424554637,4385.456750375618,4369.4842240824219]
["Aura",{"$f":"pohjatiedot!AP9","v":3966},3973,3966,3967.001768123263,3965.9999999999995,3967.0017681232625,3969.0053043697899,3973.0123768628441,3975.015913109371,3978.0212174791614,3986.0353624652689,3993.0477393281135,4000.0601161909581]
["Enonkoski",{"$f":"pohjatiedot!AP10","v":1288},1369,1288,1276.2015267175573,1266.3694656488551,1258.5038167938933,1245.7221374045803,1235.8900763358781,1224.0916030534354,1215.2427480916033,1203.4442748091606,1193.6122137404584,1186.7297709923669]
["Enontekiö",{"$f":"pohjatiedot!AP11","v":1762},1849,1762,1743.9075869937251,1728.8305761551626,1714.7586993725045,1699.681688533942,1687.6200798630921,1678.5738733599546,1667.5173987450089,1659.4763262977756,1653.4455219623505,1648.4198516828299]
{"$rows_left_out":285}