{"text_format":"1","workbook":"xlsx","n_sheets":4,"sheets":["selite","KEHIKKO","pohjatiedot","väestöennuste"],"not_rendered":{"charts":2,"images":0,"macros":0,"external_links":1,"defined_names":3,"comments":0,"pivot_tables":0},"unopened":[],"bounds":{"document_bytes":16777216,"sheet_cells":100000,"rows_first":2000,"rows_last":500,"rows_between":2000,"halvings":0,"cell_chars":16384,"cell_head_chars":4096},"cells_cut":0,"cells_raw":0,"read":"whole","date_system":"1900"}

{"sheet":"selite","index":0,"n_rows":72,"n_cols":8,"rows_kept":72,"cut":false,"hidden":false,"merged":[]}
["VALTIOVARAINMINISTERIÖ/Kunta- ja aluehallinto-osasto/vjl",null,null,null,null,null,null,"2020-06-15"]
[]
["KUNTAKONSERNIN TALOUDEN SUUNNITTELUKEHIKKO"]
[]
["Suunnittelukehikossa ei ole voitu ottaa koronan vaikutuksia täysimääräisesti valtionosuuksiin tai verotuloihin"]
["vuosien 2020 ja 2021 kohdalla, myöskään erilaisten tukipakettien lopullinen kunta-arvio ei ole selvillä"]
[]
["Kehikon käyttötarkoitus:"]
["Vuorovaikutteinen kuntakonsernin talouden suunnittelun apuväline. Kehikon avulla voidaan suunnitella konsernin talouden"]
["kehitystä pidemmällä aikavälillä. Tarkastelun kohteena ovat konsernin tuloslaskelma, rahoituslaskelmasta rahavarat, antolainat ja"]
["investoinnit sekä taseesta lainat ja kertynyt yli-/alijäämä. Pohjatietoina kehikossa ovat 2 viimeksi "]
["valmistunutta tilinpäätöstä. "]
["Tulevan kehityksen osalta tuloslaskelman erien kasvuolettamukset pohjautuvat lähtökohtaisesti"]
["uusimman valtion kuntatalousohjelman (huhtikuu 2020) mukaisiin makroarviolukuihin - ei kuntakohtaisiin ennusteisiin. "]
["Käyttäjä voi kuitenkin itse muokata em. kasvuolettamuksia sekä yleensä tuloslaskelman muita eriä."]
["Myös tuloveroprosenttia, investointeja ja antolainasaamisten määrää voidaan muuttaa."]
["Rahoituslaskelman ja taseen erät pohjautuvat jäljempänä selostettuihin olettamuksiin"]
["(pl. taseen kertynyt yli-/alijäämä = ed. tilikausien yli-/alijäämä + tilikauden yli-/alijäämä)."]
[]
["Käyttäjä voi muokata vaaleansinisellä pohjalla olevia kohtia (soluja)."]
{"$rows_left_out":53}
{"sheet":"KEHIKKO","index":1,"n_rows":118,"n_cols":16,"rows_kept":118,"cut":false,"hidden":false,"merged":[]}
["Valtiovarainministeriö/Kunta- ja aluehallinto-osasto/vjl",null,null,null,null,null,null,"VALITSE KUNTA:",null,null,null,"2020-06-15"]
["KUNTAKONSERNIN TALOUDEN SUUNNITTELUKEHIKKO",null,null,null,null,null,null,null,null,"Kunnat vuoden 2020 jaolla"]
["Muokkaa vaaleansinisellä olevia kohtia."]
[{"$f":"INDEX(pohjatiedot!$B$3:$B$297,KEHIKKO!$A$5)","v":"KOKO MAA (Manner-Suomi)"}]
[96,"TP 2018","TP 2019",2020,2021,2022,2023,2024,2025,2026,2027,2028,2029]
["TULOSLASKELMA",null,{"$f":"((C7/B7)-1)*100","v":0.13261347672157697},{"$f":"((D7/C7)-1)*100","v":9.4824624486489206E-2},0.1048427458800516,9.7813702126958724E-2,8.968077779705208E-2,8.0609565656364346E-2,7.0148276757686645E-2,5.8768858477820096E-2,{"$f":"((K7/J7)-1)*100","v":4.6795731476789726E-2},3.3213587231961661E-2,2.027940758102531E-2,"Väestön muutos%"]
["Asukasluku 31.12.",{"$f":"VLOOKUP($A$4,pohjatiedot!$B$3:$CF$297,2)","v":5488130},{"$f":"VLOOKUP($A$4,pohjatiedot!$B$3:$CF$297,42)","v":5495408},{"$f":"VLOOKUP($A$4,väestöennuste!$A$7:$K$303,4)","v":5500619},{"$f":"VLOOKUP($A$4,väestöennuste!$A$7:$K$303,5)","v":5506386},{"$f":"VLOOKUP($A$4,väestöennuste!$A$7:$K$303,6)","v":5511772},{"$f":"VLOOKUP($A$4,väestöennuste!$A$7:$K$303,7)","v":5516715},{"$f":"VLOOKUP($A$4,väestöennuste!$A$7:$K$303,8)","v":5521162},{"$f":"VLOOKUP($A$4,väestöennuste!$A$7:$K$303,9)","v":5525035},{"$f":"VLOOKUP($A$4,väestöennuste!$A$7:$K$303,10)","v":5528282},{"$f":"VLOOKUP($A$4,väestöennuste!$A$7:$K$303,11)","v":5530869},{"$f":"VLOOKUP($A$4,väestöennuste!$A$7:$M$303,12)","v":5532706},{"$f":"VLOOKUP($A$4,väestöennuste!$A$7:$N$303,13)","v":5533828},"Väestöennuste TK 2019"]
["Veroprosentti",{"$f":"VLOOKUP($A$4,pohjatiedot!$B$3:$CF$297,3)","v":19.87},{"$f":"VLOOKUP($A$4,pohjatiedot!$B$3:$CF$297,43)","v":19.899999999999999},{"$f":"VLOOKUP($A$4,pohjatiedot!$B$3:$CI$297,83)","v":19.93},{"$f":"D8","v":19.93},{"$f":"E8","v":19.93},{"$f":"F8","v":19.93},{"$f":"G8","v":19.93},{"$f":"H8","v":19.93},{"$f":"I8","v":19.93},{"$f":"J8","v":19.93},{"$f":"K8","v":19.93},{"$f":"L8","v":19.93}]
["vero-% yksikön tuotto",{"$f":"B15/B8","v":939334.07146451937},{"$f":"C15/C8","v":937917.98994974885},{"$f":"D15/D8","v":934166.31798994972},{"$f":"E15/E8","v":1001426.2928852261},1011440.5558140783,1042795.2130443146,1074079.0694356442,1106301.4415187135,1139490.4847642749,1173675.1993072031,1208885.455286419,1245152.0189450115]
[" → noston vaikutus",null,null,{"$f":"(D8-C8)*C9","v":28137.539698493532},{"$f":"(E8-D8)*D9","v":0},{"$f":"(F8-E8)*E9","v":0},0,0,0,0,0,0,0]
["Toimintatuotot (sis. valm. okäytt.)",{"$f":"VLOOKUP($A$4,pohjatiedot!$B$3:$CF$297,6)","v":25941171},{"$f":"VLOOKUP($A$4,pohjatiedot!$B$3:$CF$297,46)","v":26773679},{"$f":"C11*(1+D70/100)","v":26693357.963},{"$f":"D11*(1+E70/100)","v":27227225.122260001},{"$f":"E11*(1+F70/100)","v":27717315.174460679},{"$f":"F11*(1+G70/100)","v":28243944.162775431},{"$f":"G11*(1+H70/100)","v":28808823.046030939},29384999.506951559,29972699.497090589,30572153.487032402,31183596.556773052,31807268.487908512,null,"Näiden erien muutos-"]
["Toimintakulut",{"$f":"VLOOKUP($A$4,pohjatiedot!$B$3:$CF$297,7)","v":52925761},{"$f":"VLOOKUP($A$4,pohjatiedot!$B$3:$CF$297,47)","v":54871181},{"$f":"C12*(1+D71/100)","v":57066028.240000002},58378546.889519997,{"$f":"E12*(1+F71/100)","v":60129903.296205595},{"$f":"F12*(1+G71/100)","v":62054060.201684177},64101844.188339747,66217205.046554953,68402372.813091263,70659651.115923271,72991419.602748737,75400136.44963944,null,"prosentit syötetään"]
["Osuus osakk.yht. voitoista/tappioista",{"$f":"VLOOKUP($A$4,pohjatiedot!$B$3:$CF$297,8)","v":66298},{"$f":"VLOOKUP($A$4,pohjatiedot!$B$3:$CF$297,48)","v":70720},{"$f":"C13","v":70720},{"$f":"D13","v":70720},{"$f":"E13","v":70720},70720,70720,70720,70720,70720,70720,70720,null,"alla olevaan taulukkoon"]
["Toimintakate",{"$f":"B11-B12+B13","v":-26918292},{"$f":"C11-C12+C13","v":-28026782},{"$f":"D11-D12+D13","v":-30301950.277000003},{"$f":"E11-E12+E13","v":-31080601.767259996},-32341868.121744916,-33739396.03890875,-35222301.142308809,-36761485.539603397,-38358953.31600067,-40016777.628890872,-41737103.045975685,-43522147.961730927]
["Kunnallisverot",{"$f":"VLOOKUP($A$4,pohjatiedot!$B$3:$CF$297,9)","v":18664568},{"$f":"VLOOKUP($A$4,pohjatiedot!$B$3:$CF$297,49)","v":18664568},{"$f":"(C15+D10)*(1+D72/100)","v":18617934.717539698},{"$f":"(D15+E10)*(1+E72/100)","v":19958426.017202556},{"$f":"(E15+F10)*(1+F72/100)","v":20158010.277374581},{"$f":"F15*(1+G72/100)","v":20782908.59597319},{"$f":"(G15+H10)*(1+H72/100)","v":21406395.853852388},22048587.729467958,22710045.361351997,23391346.722192556,24093087.123858333,24815879.737574082]
["Yhteisöverot  ",{"$f":"VLOOKUP($A$4,pohjatiedot!$B$3:$CF$297,10)","v":1866127},{"$f":"VLOOKUP($A$4,pohjatiedot!$B$3:$CF$297,50)","v":1866127},{"$f":"C16*(1+D73/100)","v":1393996.8689999999},{"$f":"D16*(1+E73/100)","v":1941837.638517},1691340.5831483069,1748846.1629753495,1750595.0091383245,1752345.6041474626,1754097.9497516099,1755852.0477013614,1757607.8997490625,1759365.5076488114]
["Kiinteistöverot",{"$f":"VLOOKUP($A$4,pohjatiedot!$B$3:$CF$297,11)","v":1790525},{"$f":"VLOOKUP($A$4,pohjatiedot!$B$3:$CF$297,51)","v":1790525},{"$f":"C17*(1+D74/100)","v":1718904},{"$f":"D17*(1+E74/100)","v":1885637.6879999998},1832839.8327359997,1853001.0708960956,1871531.0816050565,1890246.392421107,1909148.856345318,1928240.3449087713,1947522.748357859,1966997.9758414375]
["Verotulot",{"$f":"VLOOKUP($A$4,pohjatiedot!$B$3:$CF$297,12)","v":22270468},{"$f":"VLOOKUP($A$4,pohjatiedot!$B$3:$CF$297,52)","v":22321220},{"$f":"SUM(D15:D17)","v":21730835.586539697},23785901.343719557,23682190.693258889,24384755.829844635,25028521.944595769,25691179.72603653,26373292.167448923,27075439.114802688,27798217.771965254,28542243.221064329]
["Valtionosuudet",{"$f":"VLOOKUP($A$4,pohjatiedot!$B$3:$CF$297,13)","v":9617527},{"$f":"VLOOKUP($A$4,pohjatiedot!$B$3:$CF$297,53)","v":9778488},{"$f":"C19*(1+D75/100)","v":11587508.280000001},{"$f":"D19*(1+E75/100)","v":10880670.274920002},{"$f":"E19*(1+F75/100)","v":11936095.291587241},{"$f":"F19*(1+G75/100)","v":12389666.912667556},{"$f":"G19*(1+H75/100)","v":12773746.586960249},13169732.731156016,13577994.445821851,13998912.273642328,14432878.554125238,14880297.78930312]
[null,null,null,"Kuntatalousohjelman (KTO, kevät -20) %-muutokset"]
{"$rows_left_out":99}
{"sheet":"pohjatiedot","index":2,"n_rows":297,"n_cols":102,"rows_kept":297,"cut":false,"hidden":false,"merged":[]}
[null,null,2018,41,42,43,44,45,46,47,48,49,50,51,52,53,54,55,56,57,58,59,60,61,62,null,null,63,64,65,66,67,68,69,70,71,72,73,74,75,76,77,2019,43,44,45,46,47,48,49,50,51,52,53,54,55,56,57,58,59,60,61,62,63,64,65,66,67,68,69,70,71,72,73,74,75,76,77,78,null,80,81,82,"vero-%",84,85,86,87,88,89,90,91,92,93,94,95,96,"2019, rivi 97",2019,99,100,101]
["Kunta nro.","Kunta","Asukasluku ","Veroprosentti",null,null,"Toimintatuotot","Toimintakulut","Osuus osakkuusyhteisöjen voitoista/tappioista","Kunnallisverot","Yhteisöverot","Kiinteistöverot","Verotulot","Valtionavut","Korkotuotot","Korkokulut","Muut rahoitustuotot","Muut rahoituskulut","VUOSIKATE",null,"Poistot ja arvonalent.","Satunnaiset erät, netto",null,"Tlikauden tulos","Tilinpäätössiirrot","Tilikauden verot","Lask. verot","Vähemmintösiirrot",null,"Tlikauden yli-/alijäämä",null,"Kertynyt yli-/alijäämä",null,null,"Nettoinv. 2018","Vuosikate-nettoinv.",null,"Rahavarat ",null,"Lainakanta ",null,null,"Asukasluku","Veroprosentti",null,null,"Toimintatuotot","Toimintakulut","Osuus osakkuusyhteisöjen voitoista/tappioista","Kunnallisverot","Yhteisöverot","Kiinteistöverot","Verotulot","Valtionavut","Korkotuotot","Korkokulut","Muut rahoitustuotot","Muut rahoituskulut","VUOSIKATE",null,"Poistot ja arvonalent.","Satunnaiset erät",null,"Tlikauden tulos","Tilinpäätössiirrot","Tilikauden verot","Lask. verot","Vähemmistöosuudet","Tlikauden yli-/alijäämä",null,"Kertynyt yli-/alijäämä",null,null,"Nettoinv.","Vuosikate-nettoinv.",null,"Rahavarat ",null,"Lainakanta ",null,"Saamiset",null,null,2020,null,null,null,null,null,null,null,null,null,null,null,null,"Kotikuntakorv+elatustuen palautus, netto","Tulorah.korjauserät","Investointimenot","Rahoitusos. inv.menoihin","Inv.hyödyk. luovutustulot","antolainauksen muutokset"]
[20,"Akaa",16611,21.75,null,null,61885,150217,9,54693,1613,3319,59625,32456,395,462,928,164,4455,null,7026,0,null,-2571,2,-94,-35,-87,null,-2785,null,-9836,null,null,-8911,null,null,6429,null,71190,null,null,16475,22.25,null,null,64620,153015,-4,54693,1613,3319,59625,33974,354,434,422,195,8715,null,8464,0,null,251,0,70,-43,-102,36,null,-9892,null,null,null,null,null,7089,null,73531,null,null,null,null,22.25,null,null,null,null,null,null,null,null,null,null,null,null,null,-729,-9837,35,253,-5]
[5,"Alajärvi",9700,21.75,null,null,56110,116873,190,24613,2142,2138,28893,36755,22,365,172,168,4736,null,5876,0,null,-1140,25,-50,0,-5,null,-1170,null,7456,null,null,-10578,null,null,8872,null,45721,null,null,9562,21.75,null,null,71516,133738,226,24613,2142,2138,28893,36500,16,393,287,123,3803,null,6114,0,null,-2311,-11,48,-5,7,-2368,null,4891,null,null,null,null,null,7664,null,50397,null,null,null,null,21.75,null,null,null,null,null,null,null,null,null,null,null,null,null,-269,-11425,781,88,-85]
[9,"Alavieska",2573,21.5,null,null,15045,30994,1,6537,259,732,7525,9826,0,29,28,13,1389,null,979,72,null,482,-1,-1,1,-1,null,480,null,926,null,null,-902,null,null,3048,null,9237,null,null,2519,22,null,null,15791,31650,1,6537,259,732,7528,9685,0,27,25,11,1774,null,1068,0,null,706,0,1,0,0,705,null,1631,null,null,null,null,null,3197,null,10120,null,null,null,null,22,null,null,null,null,null,null,null,null,null,null,null,null,null,2,-1628,18,-19,0]
[10,"Alavus",11544,21.25,null,null,71741,137803,1547,28747,2398,2756,33798,38294,85,604,761,151,7668,null,6649,0,null,1019,9,-17,-68,-4,null,939,null,20657,null,null,-8968,null,null,17462,null,71092,null,null,11468,21.25,null,null,72735,141054,562,28747,2398,2756,33901,38072,67,569,361,223,4949,null,7456,9142,null,6635,11,14,-71,17,6578,null,25846,null,null,null,null,null,18541,null,78561,null,null,null,null,21.25,null,null,null,null,null,null,null,null,null,null,null,null,null,-9761,-13156,466,9759,866]
[16,"Asikkala",8149,20.75,null,null,43453,84756,-6,24509,1436,2893,28838,17538,4,113,69,232,4795,null,4165,263,null,893,0,-13,-59,0,null,821,null,10527,null,null,-2225,null,null,7673,null,23108,null,null,8083,20.75,null,null,42608,88825,16,24509,1436,2893,28838,20631,11,104,281,157,4206,null,4111,-266,null,-171,0,3,-28,-2,-204,null,10323,null,null,null,null,null,3963,null,19437,null,null,null,null,20.75,null,null,null,null,null,null,null,null,null,null,null,null,null,-255,-3980,3,80,-6]
[18,"Askola",4958,20.75,null,null,14418,41260,-2,16454,949,1144,18547,8957,0,216,302,59,687,null,2089,2228,null,826,178,-6,0,0,null,998,null,-1633,null,null,-4241,null,null,5260,null,28168,null,null,4943,21.5,null,null,14287,39474,3,16454,949,1144,18547,8303,1,275,343,62,2833,null,2340,2496,null,2989,7,1,0,-2,2993,null,1595,null,null,null,null,null,6873,null,29815,null,null,null,null,21.5,null,null,null,null,null,null,null,null,null,null,null,null,null,-145,-4914,308,257,-1]
[19,"Aura",3984,21.75,null,null,12003,31204,1,12992,571,751,14314,6390,0,52,48,25,1475,null,1297,0,null,178,-81,0,-21,-41,null,35,null,1642,null,null,-2412,null,null,1041,null,14251,null,null,3941,21.75,null,null,12253,32020,7,12992,571,751,14314,6395,0,50,40,25,1307,null,1309,-1,null,-3,-107,0,-26,-46,-182,null,1610,null,null,null,null,null,2002,null,15560,null,null,null,null,21.5,null,null,null,null,null,null,null,null,null,null,null,null,null,25,-1414,26,178,0]
[46,"Enonkoski",1405,21,null,null,10151,19928,0,3379,569,533,4481,5829,7,14,80,18,588,null,843,5,null,-250,1,-1,-8,0,null,-258,null,6659,null,null,-802,null,null,3324,null,1082,null,null,1361,21,null,null,10276,19669,0,3379,569,533,4481,5745,4,10,99,5,1153,null,877,0,null,276,0,0,-4,0,272,null,6931,null,null,null,null,null,3555,null,804,null,null,null,null,21,null,null,null,null,null,null,null,null,null,null,null,null,null,-49,-702,12,24,0]
[47,"Enontekiö",1852,21.25,null,null,8772,22485,-11,5155,384,823,6362,8604,16,137,655,212,1564,null,1111,0,null,453,10,-23,-1,0,null,439,null,1933,null,null,-744,null,null,2270,null,9399,null,null,1838,21.25,null,null,8571,22860,-7,5155,384,823,6362,8789,18,95,619,218,1080,null,1024,0,null,56,1,30,-4,0,23,null,2110,null,null,null,null,null,1978,null,9071,null,null,null,null,21.25,null,null,null,null,null,null,null,null,null,null,null,null,null,7,-2409,492,246,131]
[49,"Espoo",283632,18,null,null,1102801,2383893,-1616,1259684,125298,117004,1501986,95314,11822,47412,39012,18089,299925,null,306013,0,null,-6088,12237,-622,2802,3973,null,12302,null,604643,null,null,-380311,null,null,1004350,null,3502631,null,null,289731,18,null,null,1171298,2544378,-1283,1259684,125298,117004,1501986,113469,11572,46261,48319,3849,270071,null,323458,0,null,-53387,15025,603,2899,3766,-32300,null,551120,null,null,null,null,null,979656,null,3802739,null,null,null,null,18,null,null,null,null,null,null,null,null,null,null,null,null,null,-85541,-661148,58030,94591,2909]
[50,"Eura",11748,20.5,null,null,36008,103147,0,38473,1964,3128,43565,25358,4,381,187,178,1416,null,5804,0,null,-4388,0,0,38,36,null,-4314,null,1114,null,null,-5657,null,null,5714,null,54266,null,null,11632,20.5,null,null,36328,104526,0,38473,1964,3128,43565,26709,3,343,162,140,1480,null,6065,3,null,-4582,0,2,26,10,-4548,null,-3389,null,null,null,null,null,4992,null,63193,null,null,null,null,21,null,null,null,null,null,null,null,null,null,null,null,null,null,-198,-9684,41,352,72]
[51,"Eurajoki",9454,18,null,null,31437,87039,0,28914,2214,19212,50340,11737,1,130,1084,1777,5653,null,5919,0,null,-266,-52,0,-7,1,null,-324,null,75926,null,null,-3839,null,null,26142,null,16111,null,null,9402,18,null,null,32393,93103,0,28914,2214,19212,50340,11120,0,49,2163,378,4206,null,5684,0,null,-1478,-49,13,-14,0,-1554,null,74437,null,null,null,null,null,24367,null,14768,null,null,null,null,18,null,null,null,null,null,null,null,null,null,null,null,null,null,-66,-4977,48,148,132]
[52,"Evijärvi",2473,21.5,null,null,7570,24216,4,6586,639,750,7975,8800,49,28,90,360,-116,null,940,0,null,-1056,-25,-2,-1,-2,null,-1086,null,2289,null,null,-1366,null,null,7034,null,8210,null,null,2425,21.5,null,null,7743,25616,1,6586,639,750,7975,9272,57,33,722,98,94,null,1115,0,null,-1021,-12,2,2,4,-1029,null,1214,null,null,null,null,null,7580,null,9505,null,null,null,null,21.5,null,null,null,null,null,null,null,null,null,null,null,null,null,-13,-2124,160,19,16]
[61,"Forssa",17028,20.5,null,null,74139,170963,0,51271,3659,5309,60239,44568,100,759,101,11,7414,null,13797,2000,null,-4383,0,-38,51,108,null,-4262,null,21404,null,null,-4493,null,null,21948,null,68161,null,null,16901,20.5,null,null,75167,172163,0,51271,3659,5309,60239,45460,129,643,132,40,8303,null,9409,0,null,-1106,4,11,200,-11,-924,null,22751,null,null,null,null,null,27447,null,68965,null,null,null,null,20.5,null,null,null,null,null,null,null,null,null,null,null,null,null,-1554,-8562,439,277,-37]
[69,"Haapajärvi",7147,22,null,null,42556,89443,-77,19358,1560,2243,23059,26347,28,368,960,747,2315,null,4044,310,null,-1419,-6,-88,25,-74,null,-1562,null,4957,null,null,-1385,null,null,21483,null,42154,null,null,7010,22.5,null,null,42245,90080,17,19358,1560,2243,23161,25932,31,392,2058,233,3058,null,4278,0,null,-1220,-1,206,28,-192,-1591,null,3187,null,null,null,null,null,22673,null,51953,null,null,null,null,22.5,null,null,null,null,null,null,null,null,null,null,null,null,null,-307,-12295,188,384,97]
[71,"Haapavesi",6854,22,null,null,27937,72355,2,17246,1309,1664,20098,27154,45,373,564,796,2276,null,3641,302,null,-1063,-7,-85,45,22,null,-1088,null,-173,null,null,-3213,null,null,12695,null,37208,null,null,6758,22,null,null,33053,77883,2,17246,1309,1664,20219,27134,29,374,693,243,3653,null,3661,0,null,-8,-1,91,-1,25,-76,null,-249,null,null,null,null,null,13882,null,37478,null,null,null,null,22,null,null,null,null,null,null,null,null,null,null,null,null,null,-30,-4315,581,234,14]
[72,"Hailuoto",974,20.5,null,null,5181,12055,0,3032,98,339,3470,3725,6,22,9,4,310,null,681,88,null,-283,-7,0,-1,-1,null,-292,null,6799,null,null,-1060,null,null,2476,null,2726,null,null,959,20.5,null,null,5157,12141,1,3032,98,339,3469,3713,6,19,4,4,308,null,692,0,null,-384,-1,1,0,0,-386,null,6414,null,null,null,null,null,1115,null,3581,null,null,null,null,20.5,null,null,null,null,null,null,null,null,null,null,null,null,null,-28,-2480,0,12,0]
[74,"Halsua",1165,22,null,null,9508,16750,52,2623,432,356,3411,4963,7,137,23,5,1072,null,833,-53,null,186,-35,-8,-2,-3,null,138,null,2074,null,null,-415,null,null,2201,null,14180,null,null,1127,22,null,null,9293,17331,53,2623,432,356,3411,4788,7,132,26,1,555,null,841,0,null,-286,-3,6,0,-2,-297,null,1778,null,null,null,null,null,2342,null,14435,null,null,null,null,23.5,null,null,null,null,null,null,null,null,null,null,null,null,null,-113,-791,14,78,40]
{"$rows_left_out":278}
{"sheet":"väestöennuste","index":3,"n_rows":301,"n_cols":13,"rows_kept":301,"cut":false,"hidden":false,"merged":[]}
["Väestöennuste 2019 kunnittain 2020-2029"]
["TK, Syyskuu 2019"]
["2020 kuntajako",2,3,4,5,6,7,8,9,10,11,12,13]
[]
[null,2018,2019,2020,2021,2022,2023,2024,2025,2026,2027,2028,2029]
[]
["Akaa",{"$f":"pohjatiedot!C3","v":16611},{"$f":"pohjatiedot!AQ3","v":16475},16353,16229,16108,15984,15861,15743,15630,15523,15419,15317]
["Alajärvi",{"$f":"pohjatiedot!C4","v":9700},{"$f":"pohjatiedot!AQ4","v":9562},9472,9363,9256,9153,9052,8952,8854,8757,8659,8565]
["Alavieska",{"$f":"pohjatiedot!C5","v":2573},{"$f":"pohjatiedot!AQ5","v":2519},2496,2461,2428,2396,2366,2338,2309,2283,2257,2231]
["Alavus",{"$f":"pohjatiedot!C6","v":11544},{"$f":"pohjatiedot!AQ6","v":11468},11253,11118,10988,10861,10736,10608,10486,10365,10250,10136]
["Asikkala",{"$f":"pohjatiedot!C7","v":8149},{"$f":"pohjatiedot!AQ7","v":8083},8032,7980,7929,7874,7819,7761,7707,7653,7600,7548]
["Askola",{"$f":"pohjatiedot!C8","v":4958},{"$f":"pohjatiedot!AQ8","v":4943},4947,4938,4924,4912,4900,4889,4877,4864,4846,4827]
["Aura",{"$f":"pohjatiedot!C9","v":3984},{"$f":"pohjatiedot!AQ9","v":3941},3973,3968,3963,3959,3951,3946,3940,3935,3932,3925]
["Enonkoski",{"$f":"pohjatiedot!C10","v":1405},{"$f":"pohjatiedot!AQ10","v":1361},1369,1352,1333,1316,1300,1283,1269,1254,1239,1224]
["Enontekiö",{"$f":"pohjatiedot!C11","v":1852},{"$f":"pohjatiedot!AQ11","v":1838},1849,1850,1850,1852,1854,1855,1856,1855,1853,1848]
["Espoo",{"$f":"pohjatiedot!C12","v":283632},{"$f":"pohjatiedot!AQ12","v":289731},292052,296067,299943,303678,307254,310666,313918,317005,319936,322710]
["Eura",{"$f":"pohjatiedot!C13","v":11748},{"$f":"pohjatiedot!AQ13","v":11632},11504,11386,11267,11148,11033,10918,10809,10705,10602,10499]
["Eurajoki",{"$f":"pohjatiedot!C14","v":9454},{"$f":"pohjatiedot!AQ14","v":9402},9505,9522,9534,9539,9540,9532,9516,9493,9467,9439]
["Evijärvi",{"$f":"pohjatiedot!C15","v":2473},{"$f":"pohjatiedot!AQ15","v":2425},2385,2342,2300,2260,2223,2187,2153,2118,2082,2050]
["Forssa",{"$f":"pohjatiedot!C16","v":17028},{"$f":"pohjatiedot!AQ16","v":16901},16759,16629,16505,16384,16265,16149,16036,15923,15811,15703]
{"$rows_left_out":281}