{"text_format":"1","workbook":"xlsx","n_sheets":4,"sheets":["selite","KEHIKKO","pohjatiedot","väestöennuste"],"not_rendered":{"charts":2,"images":0,"macros":0,"external_links":1,"defined_names":3,"comments":0,"pivot_tables":0},"unopened":[],"bounds":{"document_bytes":16777216,"sheet_cells":100000,"rows_first":2000,"rows_last":500,"rows_between":2000,"halvings":0,"cell_chars":16384,"cell_head_chars":4096},"cells_cut":0,"cells_raw":0,"read":"whole","date_system":"1900"}

{"sheet":"selite","index":0,"n_rows":69,"n_cols":8,"rows_kept":69,"cut":false,"hidden":false,"merged":[]}
["VALTIOVARAINMINISTERIÖ/Kunta- ja aluehallinto-osasto/vjl",null,null,null,null,null,null,"2018-06-14"]
[]
["KUNTAKONSERNIN TALOUDEN SUUNNITTELUKEHIKKO"]
[]
["Kehikon käyttötarkoitus:"]
["Vuorovaikutteinen kuntakonsernin talouden suunnittelun apuväline. Kehikon avulla voidaan suunnitella konsernin talouden"]
["kehitystä pidemmällä aikavälillä. Tarkastelun kohteena ovat konsernin tuloslaskelma, rahoituslaskelmasta rahavarat, antolainat ja"]
["investoinnit sekä taseesta lainat ja kertynyt yli-/alijäämä. Pohjatietoina kehikossa ovat 2 viimeksi "]
["valmistunutta tilinpäätöstä. "]
["Tulevan kehityksen osalta tuloslaskelman erien kasvuolettamukset pohjautuvat lähtökohtaisesti"]
["uusimman valtion kuntatalousohjelman (huhtikuu 2018) mukaisiin makroarviolukuihin - ei kuntakohtaisiin ennusteisiin. "]
["Käyttäjä voi kuitenkin itse muokata em. kasvuolettamuksia sekä yleensä tuloslaskelman muita eriä."]
["Myös tuloveroprosenttia, investointeja ja antolainasaamisten määrää voidaan muuttaa."]
["Rahoituslaskelman ja taseen erät pohjautuvat jäljempänä selostettuihin olettamuksiin"]
["(pl. taseen kertynyt yli-/alijäämä = ed. tilikausien yli-/alijäämä + tilikauden yli-/alijäämä)."]
[]
["Käyttäjä voi muokata vaaleansinisellä pohjalla olevia kohtia (soluja)."]
[]
["Kehikon laskentapohja:"]
["Asukasluku:"]
{"$rows_left_out":50}
{"sheet":"KEHIKKO","index":1,"n_rows":118,"n_cols":16,"rows_kept":118,"cut":false,"hidden":false,"merged":[]}
["Valtiovarainministeriö/Kunta- ja aluehallinto-osasto/vjl",null,null,null,null,null,null,"VALITSE KUNTA:",null,null,null,"2018-06-14"]
["KUNTAKONSERNIN TALOUDEN SUUNNITTELUKEHIKKO",null,null,null,null,null,null,null,null,"Kunnat vuoden 2018 jaolla"]
["Muokkaa vaaleansinisellä olevia kohtia."]
[{"$f":"INDEX(pohjatiedot!$B$3:$B$298,KEHIKKO!$A$5)","v":"KOKO MAA (Manner-Suomi)"}]
[96,"TP 2016","TP 2017",2018,2019,2020,2021,2022,2023,2024,2025,2026,2027]
["TULOSLASKELMA",null,null,null,null,null,null,null,null,null,"sama kuin ed.vuonna"]
["Asukasluku 31.12.",{"$f":"VLOOKUP($A$4,pohjatiedot!$B$3:$CF$298,2)","v":5474083},{"$f":"VLOOKUP($A$4,pohjatiedot!$B$3:$CF$298,42)","v":5483641},{"$f":"VLOOKUP($A$4,väestöennuste!$A$8:$K$305,4)","v":5482281},{"$f":"VLOOKUP($A$4,väestöennuste!$A$8:$K$305,5)","v":5503261},{"$f":"VLOOKUP($A$4,väestöennuste!$A$8:$K$305,6)","v":5524063},{"$f":"VLOOKUP($A$4,väestöennuste!$A$8:$K$305,7)","v":5544619},{"$f":"VLOOKUP($A$4,väestöennuste!$A$8:$K$305,8)","v":5564874},{"$f":"VLOOKUP($A$4,väestöennuste!$A$8:$K$305,9)","v":5584791},{"$f":"VLOOKUP($A$4,väestöennuste!$A$8:$K$305,10)","v":5604290},{"$f":"VLOOKUP($A$4,väestöennuste!$A$8:$K$305,11)","v":5623257},{"$f":"K7","v":5623257},{"$f":"L7","v":5623257},"Väestöennuste TK 2015"]
["Veroprosentti",{"$f":"VLOOKUP($A$4,pohjatiedot!$B$3:$CF$298,3)","v":19.89},{"$f":"VLOOKUP($A$4,pohjatiedot!$B$3:$CF$298,43)","v":19.920000000000002},{"$f":"VLOOKUP($A$4,pohjatiedot!$B$3:$CI$298,83)","v":19.87},{"$f":"D8","v":19.87},{"$f":"VLOOKUP($A$4,pohjatiedot!$B$3:$CI$298,84)","v":8.4600000000000009},8.4600000000000009,8.4600000000000009,8.4600000000000009,8.4600000000000009,8.4600000000000009,8.4600000000000009,8.4600000000000009,null,"Vuoden 2020 veroprosentti on saatu vähentämällä kunnilta 11,41 %-yksikköä"]
["vero-% yksikön tuotto",{"$f":"B15/B8","v":945567.82302664651},{"$f":"C15/C8","v":945165.21084337344},{"$f":"D15/D8","v":973520.16716867464},{"$f":"E15/E8","v":1015381.5343569276},1192413.1848505998,1143524.2442717252,1165251.2049128879,1187390.9778062329,1209951.406384551,1232940.4831058574,1256366.3522848685,1280237.3129782807]
[" → noston vaikutus",null,null,{"$f":"(D8-C8)*C9","v":-47258.260542169344},{"$f":"(E8-D8)*D9","v":0},0,0,{"$f":"(H8-G8)*G9","v":0},0,0,0,0,0]
["Toimintatuotot (sis. valm. okäytt.)",{"$f":"VLOOKUP($A$4,pohjatiedot!$B$3:$CF$298,6)","v":23891978},{"$f":"VLOOKUP($A$4,pohjatiedot!$B$3:$CF$298,46)","v":24653392},{"$f":"C11*(1+D70/100)","v":24776658.959999997},{"$f":"D11*(1+E70/100)","v":25272192.139199998},{"$f":"E11*(1+F70/100)","v":20470475.632752001},{"$f":"F11*(1+G70/100)","v":20982237.523570798},{"$f":"G11*(1+H70/100)","v":21485811.224136498},22001470.693515774,22529505.990160152,23070214.133923996,23623899.273138173,24190872.855693489,null,"Näiden erin muutos-"]
["Toimintakulut",{"$f":"VLOOKUP($A$4,pohjatiedot!$B$3:$CF$298,7)","v":50389944},{"$f":"VLOOKUP($A$4,pohjatiedot!$B$3:$CF$298,47)","v":50758330},{"$f":"C12*(1+D71/100)","v":49946196.719999999},51494528.818319991,{"$f":"E12*(1+F71/100)","v":26004737.053251594},{"$f":"F12*(1+G71/100)","v":26654855.479582883},27347881.722052038,28058926.646825392,28788458.739642851,29536958.666873567,30304919.592212278,31092847.501609799,null,"prosentit syötetään"]
["Osuus osakk.yht. voitoista/tappioista",{"$f":"VLOOKUP($A$4,pohjatiedot!$B$3:$CF$298,8)","v":68081},{"$f":"VLOOKUP($A$4,pohjatiedot!$B$3:$CF$298,48)","v":81900},{"$f":"C13","v":81900},{"$f":"D13","v":81900},{"$f":"E13","v":81900},81900,81900,81900,81900,81900,81900,81900,null,"alla olevaan taulukkoon"]
["Toimintakate",{"$f":"B11-B12+B13","v":-26429885},{"$f":"C11-C12+C13","v":-26023038},{"$f":"D11-D12+D13","v":-25087637.760000002},{"$f":"E11-E12+E13","v":-26140436.679119993},-5452361.420499593,-5590717.9560120851,-5780170.4979155399,-5975555.9533096179,-6177052.7494826987,-6384844.5329495706,-6599120.3190741055,-6820074.6459163092]
["Kunnallisverot",{"$f":"VLOOKUP($A$4,pohjatiedot!$B$3:$CF$298,9)","v":18807344},{"$f":"VLOOKUP($A$4,pohjatiedot!$B$3:$CF$298,49)","v":18827691},{"$f":"(C15+D10)*(1+D72/100)","v":19343845.721641567},{"$f":"(D15+E10)*(1+E72/100)","v":20175631.087672152},{"$f":"(E15+F10)*(1+F72/100)","v":10087815.543836076},{"$f":"F15*(1+G72/100)","v":9674215.1065387968},{"$f":"(G15+H10)*(1+H72/100)","v":9858025.1935630329},{"$f":"(H15+I10)*(1+I72/100)","v":10045327.67224073},10236188.898013303,10430676.487075554,10628859.340329988,10830807.667796256]
["Yhteisöverot  ",{"$f":"VLOOKUP($A$4,pohjatiedot!$B$3:$CF$298,10)","v":1539341},{"$f":"VLOOKUP($A$4,pohjatiedot!$B$3:$CF$298,50)","v":1887798},{"$f":"C16*(1+D73/100)","v":1912339.3739999998},{"$f":"D16*(1+E73/100)","v":1944849.1433579996},1503368.3878157337,1515395.3349182596,1386586.7314502075,1268726.8592769399,1160885.0762384001,1062209.8447581362,971922.00795369467,889308.63727763062]
["Kiinteistöverot",{"$f":"VLOOKUP($A$4,pohjatiedot!$B$3:$CF$298,11)","v":1640918},{"$f":"VLOOKUP($A$4,pohjatiedot!$B$3:$CF$298,51)","v":1719296},{"$f":"C17*(1+D74/100)","v":1770874.8800000001},1932024.4940800001,1966800.9349734401,1992369.3471280946,2066087.012971834,2142532.2324517919,2221805.9250525078,2304012.7442794503,2389261.2158177895,2477663.8808030477]
["Verotulot",{"$f":"VLOOKUP($A$4,pohjatiedot!$B$3:$CF$298,12)","v":21987603},{"$f":"VLOOKUP($A$4,pohjatiedot!$B$3:$CF$298,52)","v":22434785},{"$f":"SUM(D15:D17)","v":23027059.975641567},24052504.725110151,13557984.866625249,13181979.788585151,13310698.937985074,13456586.763969462,13618879.899304211,13796899.07611314,13990042.564101472,14197780.185876936]
["Valtionosuudet",{"$f":"VLOOKUP($A$4,pohjatiedot!$B$3:$CF$298,13)","v":10050212},{"$f":"VLOOKUP($A$4,pohjatiedot!$B$3:$CF$298,53)","v":9699290},{"$f":"C19*(1+D75/100)","v":9912674.3800000008},{"$f":"D19*(1+E75/100)","v":10130753.216360001},{"$f":"E19*(1+F75/100)","v":2988572.1988262008},{"$f":"F19*(1+G75/100)","v":2779372.1449083667},{"$f":"G19*(1+H75/100)","v":2809945.2385023586},2840854.636125884,2872104.0371232685,2903697.1815316239,2935637.8505284716,2967929.8668842847]
[null,null,null,"Kuntatalousohjelma-->"]
{"$rows_left_out":99}
{"sheet":"pohjatiedot","index":2,"n_rows":298,"n_cols":103,"rows_kept":298,"cut":false,"hidden":false,"merged":[]}
[null,null,2016,41,42,43,44,45,46,47,48,49,50,51,52,53,54,55,56,57,58,59,60,61,62,null,null,63,64,65,66,67,68,69,70,71,72,73,74,75,76,77,2017,43,44,45,46,47,48,49,50,51,52,53,54,55,56,57,58,59,60,61,62,63,64,65,66,67,68,69,70,71,72,73,74,75,76,77,78,null,80,81,"vero-%","vero-%",11.41,null,null,2016,2016,2010,85,2017,2018,89,90,91,92,null,"2017, rivi 98",2017,100,101,102]
["Kunta nro.","Kunta","Asukasluku ","Veroprosentti","vero-% yksikön tuotto"," -> noston vaikutus","Toimintatuotot","Toimintakulut","Osuus osakkuusyhteisöjen voitoista/tappioista","Kunnallisverot","Yhteisöverot","Kiinteistöverot","Verotulot","Valtionavut","Korkotuotot","Korkokulut","Muut rahoitustuotot","Muut rahoituskulut","VUOSIKATE"," €/as","Poistot ja arvonalent.","Satunnaiset erät",null,"Tlikauden tulos","Tilinpäätössiirrot","Tilikauden verot","Lask. verot","Vähemmintösiirrot",null,"Tlikauden yli-/alijäämä","€/as","Kertynyt yli-/alijäämä","€/as",null,"Nettoinv.","Vuosikate-nettoinv.","€/as","Rahavarat (ent. kassavarat)","€/as","Lainakanta ","€/as","Saamiset","Asukasluku","Veroprosentti","vero-% yksikön tuotto"," -> noston vaikutus","Toimintatuotot","Toimintakulut","Osuus osakkuusyhteisöjen voitoista/tappioista","Kunnallisverot","Yhteisöverot","Kiinteistöverot","Verotulot","Valtionavut","Korkotuotot","Korkokulut","Muut rahoitustuotot","Muut rahoituskulut","VUOSIKATE"," €/as","Poistot ja arvonalent.","Satunnaiset erät",null,"Tlikauden tulos","Tilinpäätössiirrot","Tilikauden verot","Lask. verot","Vähemmistöosuudet","Tlikauden yli-/alijäämä","€/as","Kertynyt yli-/alijäämä","€/as",null,"Nettoinv.","Vuosikate-nettoinv.","€/as","Rahavarat ","€/as","Lainakanta ","€/as","Saamiset",null,null,2018,2020,null,null,"vos-hava","hava","vos-hava","Harkvar10","Valtionosuudet","Valtionosuudet",null,null,null,"vos-hava 2015","Kotikuntakorv+elatustuen palautus, netto","Tulorah.korjauserät","Investointimenot","Rahoitusos. inv.menoihin","Inv.hyödyk. luovutustulot","antolainauksen muutokset"]
[20,"Akaa",16923,21.25,null,null,57740,143891,22,55165,1606,3377,60148,34067,374,691,287,155,7901,null,7116,98,null,883,9,73,-46,-84,null,689,null,-7699,null,null,-5554,null,null,9534,null,70428,null,null,16769,21.25,null,null,58889,142923,96,54017,1893,3489,{"$f":"AX3+AY3+AZ3","v":59399},32904,385,646,308,164,8248,null,7001,0,null,1247,1,84,-57,-71,1036,null,-6683,null,null,null,null,null,6420,null,65864,null,null,null,null,21.75,{"$f":"CF3-$CG$1","v":10.34},null,null,null,null,27814,0,30572.896963830583,29351.912102991082,null,{"$f":"CO3-CP3","v":29351.912102991082},null,{"$f":"N3-CR3","v":34067},null,-694,-7344,97,1219,114]
[5,"Alajärvi",9899,22,null,null,66345,123039,77,25084,2039,2313,29436,39395,21,498,185,128,11794,null,4798,0,null,6996,83,68,-9,-65,null,6937,null,5760,null,null,-9329,null,null,9170,null,38620,null,null,9831,21.75,null,null,54164,112513,114,25065,2438,2156,{"$f":"AX4+AY4+AZ4","v":29659},37946,21,367,218,135,9107,null,5188,0,null,3919,9,87,-16,-102,3723,null,9052,null,null,null,null,null,9429,null,41635,null,null,null,null,21.75,{"$f":"CF4-$CG$1","v":10.34},null,null,null,null,30121,0,35696.984931790576,34318.375302499961,null,{"$f":"CO4-CP4","v":34318.375302499961},null,{"$f":"N4-CR4","v":39395},null,-367,-10966,647,849,11]
[9,"Alavieska",2639,21.5,null,null,16234,32053,0,6892,271,522,7685,9849,1,51,24,18,1669,null,1054,681,null,1296,0,-1,-1,-1,null,1295,null,329,null,null,-525,null,null,1978,null,10838,null,null,2610,21.5,null,null,14579,30594,1,6494,285,505,7284,9778,0,45,26,17,1010,null,1059,0,null,-49,0,1,-1,0,-51,null,300,null,null,null,null,null,2257,null,8306,null,null,null,null,21.5,10.09,null,null,null,null,7636,0,8918.4021211721301,8666.7788811986575,null,8666.7788811986575,null,{"$f":"N5-CR5","v":9849},null,28,-1100,201,4,0]
[10,"Alavus",11907,21.25,null,null,64883,130531,541,29668,2203,2611,34482,38870,20,469,939,-10,8639,null,6022,0,null,2617,-12,6,-50,-34,null,2515,null,12545,null,null,-10266,null,null,15871,null,69825,null,null,11713,21.25,null,null,70759,136082,1545,29789,2699,2730,35218,38629,62,641,816,-57,10255,null,6434,0,null,3821,-4,18,-30,-31,3738,null,20120,null,null,null,null,null,17750,null,70327,null,null,null,null,21.25,9.84,null,null,null,null,24410,0,38667.828399451791,37624.463588470207,null,37624.463588470207,null,38870,null,-1239,-9360,768,1177,-388]
[16,"Asikkala",8323,20.75,null,null,31656,71447,4,25836,1430,2659,29925,17906,8,184,238,409,7698,null,4014,-6,null,3678,-1,0,-81,0,null,3596,null,7509,null,null,-3392,null,null,3141,null,28449,null,null,8248,20.75,null,null,42592,82843,-3,25298,1616,2787,29701,17513,4,124,246,203,6882,null,4354,64,null,2592,0,2,-43,0,2547,null,9751,null,null,null,null,null,4601,null,24863,null,null,null,null,20.75,9.34,null,null,null,null,15106,0,17874.508686845202,17540.251548889391,null,17540.251548889391,null,17906,null,-441,-3984,196,1228,-159]
[18,"Askola",5046,20.25,null,null,14258,39091,0,17262,868,1044,19174,7136,0,192,265,49,1501,null,1892,0,null,-391,93,0,0,0,null,-298,null,-2045,null,null,-2284,null,null,1720,null,21697,null,null,4990,20.75,null,null,15461,39934,-30,16579,1038,1139,18756,7325,0,172,295,53,1648,null,2120,0,null,-472,123,3,0,0,-352,null,-2503,null,null,null,null,null,2550,null,24594,null,null,null,null,20.75,9.34,null,null,null,null,5973,0,7397.7858976601101,7458.1080757415002,null,7458.1080757415002,null,7136,null,-188,-4053,12,310,0]
[19,"Aura",3984,21.75,null,null,12522,30312,0,13272,758,410,14440,6032,2,68,15,3,2628,null,1259,0,null,1369,0,0,0,-49,null,1320,null,-543,null,null,-907,null,null,1194,null,16296,null,null,3991,21.75,null,null,12669,30038,1,13597,745,531,14873,5984,3,65,25,3,3449,null,1306,0,null,2143,0,0,0,-24,2119,null,1556,null,null,null,null,null,2348,null,14775,null,null,null,null,21.75,10.34,null,null,null,null,4924,0,5986.1344989335448,5584.2465923015225,null,5584.2465923015225,null,6032,null,4,-1111,10,100,-4]
[46,"Enonkoski",1453,21,null,null,9399,17959,0,3570,550,424,4544,5227,11,24,214,2,1410,null,780,-65,null,565,-79,0,9,0,null,495,null,6061,null,null,-646,null,null,3334,null,1164,null,null,1416,21,null,null,10316,19838,0,3723,595,535,4853,5683,27,31,76,5,1082,null,787,-16,null,279,0,0,-36,0,243,null,6840,null,null,null,null,null,3081,null,1085,null,null,null,null,21,9.59,null,null,null,null,4469,0,5272.4930687586148,5110.4539175955097,null,5110.4539175955097,null,5227,null,-30,-1552,18,442,-53]
[47,"Enontekiö",1872,21.25,null,null,2936,16836,-4,5003,326,822,6151,8935,104,186,545,279,1366,null,1108,0,null,258,0,0,2,-1,null,259,null,576,null,null,-2230,null,null,2879,null,11675,null,null,1893,21.25,null,null,4225,17496,2,4963,410,830,6203,8824,16,173,616,195,2022,null,1177,-22,null,823,-11,0,-3,0,809,null,1400,null,null,null,null,null,1956,null,10397,null,null,null,null,21.25,9.84,null,null,null,null,7672,0,8847.6778030030855,8708.0230920612867,null,8708.0230920612867,null,8935,null,-5,-2967,2153,50,16]
[49,"Espoo",274583,18,null,null,982749,2234818,-2334,1226153,120589,99740,1446482,116040,12945,43692,25100,4973,297500,null,237379,13541,null,73662,60,1649,10,29,null,72112,null,629653,null,null,-632118,null,null,1033578,null,3186678,null,null,279044,18,null,null,1012445,2264850,994,1236961,137156,116153,1490270,84559,11838,55066,42057,2946,319301,null,267979,1200,null,52522,17,390,-773,-463,50913,null,600201,null,null,null,null,null,1080286,null,3429679,null,null,null,null,18,6.59,null,null,null,null,24390,0,35423.51400928435,29148.660299252388,null,29148.660299252388,null,116040,null,-30407,-616503,48410,46613,1928]
[50,"Eura",12004,20.5,null,null,35238,100185,0,38341,2183,3129,43653,27037,7,710,1222,14,6248,null,5435,0,null,813,0,1,-127,-43,null,642,null,4004,null,null,-6427,null,null,5971,null,54035,null,null,11910,20.5,null,null,36426,99266,0,39017,2303,3077,44397,26168,-13,453,183,186,7256,null,5748,0,null,1508,0,0,-4,30,1534,null,5504,null,null,null,null,null,5347,null,52506,null,null,null,null,20.5,9.09,null,null,null,null,22268,0,23934.034289951676,22959.415180906744,null,22959.415180906744,null,27037,null,-381,-6603,191,652,265]
[51,"Eurajoki",9418,18,null,null,21029,59307,-6,18489,1426,18126,38041,8609,110,39,1129,398,9163,null,4275,3,null,4891,0,1,-6,2,null,4886,null,73485,null,null,-8018,null,null,24633,null,3694,null,null,9521,18,null,null,30898,86250,0,51919,0,0,51919,13352,41,133,1290,454,10663,null,5641,2,null,5024,29,3,-13,0,5037,null,76253,null,null,null,null,null,24191,null,17545,null,null,null,null,18,6.59,null,null,null,null,5750,0,13206.549841220543,11167.549277070151,null,11167.549277070151,null,8609,null,108,-7916,39,486,-358]
[52,"Evijärvi",2535,21.5,null,null,7088,23575,4,6961,933,721,8615,8566,197,26,58,23,904,null,834,0,null,70,-30,6,-2,-7,null,25,null,3286,null,null,-1197,null,null,6655,null,6210,null,null,2499,21.5,null,null,7148,23269,0,6674,827,723,8224,8533,94,22,482,34,1156,null,888,0,null,268,-28,8,-2,-7,223,null,3481,null,null,null,null,null,7504,null,7285,null,null,null,null,21.5,10.09,null,null,null,null,7542,0,8103.2899261589409,8180.3979916942644,null,8180.3979916942644,null,8566,null,-44,-976,52,159,15]
[61,"Forssa",17332,20,null,null,73748,166829,56,51886,3143,5379,60408,47018,51,673,199,45,13933,null,8501,0,null,5432,171,7,-47,94,null,5643,null,24755,null,null,-16579,null,null,19683,null,60008,null,null,17185,20.5,null,null,73061,166862,143,51892,3856,5326,61074,44796,243,763,88,22,11758,null,10896,0,null,862,3,11,-62,120,912,null,25667,null,null,null,null,null,19358,null,65801,null,null,null,null,20.5,9.09,null,null,null,null,30500,0,40176.394675010488,39480.900657952698,null,39480.900657952698,null,47018,null,-1581,-7329,17,353,3]
[69,"Haapajärvi",7332,22,null,null,40616,87803,19,19865,1382,1889,23136,27083,15,516,1264,186,3529,null,3603,-259,null,-333,-2,89,19,-53,null,-458,null,4756,null,null,-5958,null,null,20007,null,42099,null,null,7251,22,null,null,41518,85945,28,19282,1575,1893,22750,26501,20,515,923,279,4898,null,3904,-24,null,970,-3,80,-4,-99,784,null,5116,null,null,null,null,null,20153,null,43029,null,null,null,null,22,10.59,null,null,null,null,21546,0,23664.460169336282,23000.310845673146,null,23000.310845673146,null,27083,null,-74,-7120,253,576,-435]
[71,"Haapavesi",7098,22,null,null,52007,93366,1,18139,1146,1521,20806,22953,57,327,374,194,2310,null,3844,0,null,-1534,-4,0,-40,-1,null,-1579,null,-1575,null,null,-4137,null,null,11738,null,48554,null,null,6970,22,null,null,30893,70568,2,17804,1291,1673,20768,23997,78,362,339,226,4796,null,3611,0,null,1185,-1,118,-27,2,1041,null,214,null,null,null,null,null,13134,null,38371,null,null,null,null,22,10.59,null,null,null,null,19865,0,24033.385262004795,23689.694250044173,null,23689.694250044173,null,22953,null,-267,-5797,127,3685,-13]
[72,"Hailuoto",994,20,null,null,4977,11338,0,2916,93,326,3335,3647,14,23,3,1,615,null,685,0,null,-70,-1,0,-1,-1,null,-73,null,6621,null,null,-1119,null,null,2661,null,3392,null,null,967,20,null,null,5176,11532,1,3245,114,332,3691,3733,9,24,92,1,1145,null,674,0,null,471,4,1,-1,0,473,null,7093,null,null,null,null,null,3536,null,3199,null,null,null,null,20.5,9.09,null,null,null,null,3147,0,3476.3868461876737,3281.9833900359199,null,3281.9833900359199,null,3647,null,-84,-511,5,137,0]
[74,"Halsua",1219,21.5,null,null,5581,13051,34,2891,315,443,3649,4633,10,153,25,1,727,null,774,-4,null,-51,1,3,2,-3,null,-54,null,2337,null,null,-549,null,null,1426,null,13613,null,null,1171,22,null,null,9263,15712,75,2805,356,551,3712,4155,8,143,29,1,1386,null,844,0,null,542,-7,4,-3,-2,526,null,2010,null,null,null,null,null,1910,null,14372,null,null,null,null,22,10.59,null,null,null,null,3768,0,4156.0472573350735,4173.2283887804433,null,4173.2283887804433,null,4633,null,-77,-799,15,53,130]
{"$rows_left_out":279}
{"sheet":"väestöennuste","index":3,"n_rows":303,"n_cols":11,"rows_kept":303,"cut":false,"hidden":false,"merged":[]}
["Väestöennuste 2015 kunnittain 2017-2024"]
["TK, 28.9.2015"]
["2017 kuntajako",3,4,6,7,8,9,10,11,12,13]
[]
[null,2015,2016,2017,2018,2019,2020,2021,2022,2023,2024]
[]
[]
["Akaa",{"$f":"pohjatiedot!C3","v":16923},{"$f":"pohjatiedot!AQ3","v":16769},17070,17092,17116,17150,17184,17218,17248,17275]
["Alajärvi",{"$f":"pohjatiedot!C4","v":9899},{"$f":"pohjatiedot!AQ4","v":9831},10001,9923,9845,9769,9697,9629,9560,9499]
["Alavieska",{"$f":"pohjatiedot!C5","v":2639},{"$f":"pohjatiedot!AQ5","v":2610},2650,2631,2615,2599,2586,2572,2560,2549]
["Alavus",{"$f":"pohjatiedot!C6","v":11907},{"$f":"pohjatiedot!AQ6","v":11713},11877,11780,11689,11605,11527,11454,11384,11319]
["Asikkala",{"$f":"pohjatiedot!C7","v":8323},{"$f":"pohjatiedot!AQ7","v":8248},8294,8262,8239,8219,8200,8184,8172,8159]
["Askola",{"$f":"pohjatiedot!C8","v":5046},{"$f":"pohjatiedot!AQ8","v":4990},5169,5220,5270,5320,5365,5410,5449,5490]
["Aura",{"$f":"pohjatiedot!C9","v":3984},{"$f":"pohjatiedot!AQ9","v":3991},4035,4058,4079,4099,4118,4134,4152,4168]
["Enonkoski",{"$f":"pohjatiedot!C10","v":1453},{"$f":"pohjatiedot!AQ10","v":1416},1462,1445,1430,1416,1401,1388,1375,1363]
["Enontekiö",{"$f":"pohjatiedot!C11","v":1872},{"$f":"pohjatiedot!AQ11","v":1893},1896,1902,1910,1917,1926,1936,1945,1956]
["Espoo",{"$f":"pohjatiedot!C12","v":274583},{"$f":"pohjatiedot!AQ12","v":279044},273484,277445,281312,285087,288763,292333,295784,299117]
["Eura",{"$f":"pohjatiedot!C13","v":12004},{"$f":"pohjatiedot!AQ13","v":11910},12205,12166,12127,12091,12059,12028,11995,11960]
["Eurajoki",{"$f":"pohjatiedot!C14","v":9418},{"$f":"pohjatiedot!AQ14","v":9521},5964,5972,5984,5995,6007,6016,6024,6029]
["Evijärvi",{"$f":"pohjatiedot!C15","v":2535},{"$f":"pohjatiedot!AQ15","v":2499},2596,2571,2548,2528,2510,2492,2474,2458]
{"$rows_left_out":283}