{"text_format":"1","workbook":"xlsx","n_sheets":4,"sheets":["selite","KEHIKKO","pohjatiedot","väestöennuste"],"not_rendered":{"charts":2,"images":0,"macros":0,"external_links":1,"defined_names":3,"comments":0,"pivot_tables":0},"unopened":[],"bounds":{"document_bytes":16777216,"sheet_cells":100000,"rows_first":2000,"rows_last":500,"rows_between":2000,"halvings":0,"cell_chars":16384,"cell_head_chars":4096},"cells_cut":0,"cells_raw":0,"read":"whole","date_system":"1900"}

{"sheet":"selite","index":0,"n_rows":69,"n_cols":8,"rows_kept":69,"cut":false,"hidden":false,"merged":[]}
["VALTIOVARAINMINISTERIÖ/Kunta- ja aluehallinto-osasto/vjl",null,null,null,null,null,null,"2019-06-14"]
[]
["KUNTAKONSERNIN TALOUDEN SUUNNITTELUKEHIKKO"]
[]
["Kehikon käyttötarkoitus:"]
["Vuorovaikutteinen kuntakonsernin talouden suunnittelun apuväline. Kehikon avulla voidaan suunnitella konsernin talouden"]
["kehitystä pidemmällä aikavälillä. Tarkastelun kohteena ovat konsernin tuloslaskelma, rahoituslaskelmasta rahavarat, antolainat ja"]
["investoinnit sekä taseesta lainat ja kertynyt yli-/alijäämä. Pohjatietoina kehikossa ovat 2 viimeksi "]
["valmistunutta tilinpäätöstä. "]
["Tulevan kehityksen osalta tuloslaskelman erien kasvuolettamukset pohjautuvat lähtökohtaisesti"]
["uusimman valtion kuntatalousohjelman (huhtikuu 2019) mukaisiin makroarviolukuihin - ei kuntakohtaisiin ennusteisiin. "]
["Käyttäjä voi kuitenkin itse muokata em. kasvuolettamuksia sekä yleensä tuloslaskelman muita eriä."]
["Myös tuloveroprosenttia, investointeja ja antolainasaamisten määrää voidaan muuttaa."]
["Rahoituslaskelman ja taseen erät pohjautuvat jäljempänä selostettuihin olettamuksiin"]
["(pl. taseen kertynyt yli-/alijäämä = ed. tilikausien yli-/alijäämä + tilikauden yli-/alijäämä)."]
[]
["Käyttäjä voi muokata vaaleansinisellä pohjalla olevia kohtia (soluja)."]
[]
["Kehikon laskentapohja:"]
["Asukasluku:"]
{"$rows_left_out":50}
{"sheet":"KEHIKKO","index":1,"n_rows":118,"n_cols":16,"rows_kept":118,"cut":false,"hidden":false,"merged":[]}
["Valtiovarainministeriö/Kunta- ja aluehallinto-osasto/vjl",null,null,null,null,null,null,"VALITSE KUNTA:",null,null,null,"2019-06-05"]
["KUNTAKONSERNIN TALOUDEN SUUNNITTELUKEHIKKO",null,null,null,null,null,null,null,null,"Kunnat vuoden 2019 jaolla"]
["Muokkaa vaaleansinisellä olevia kohtia."]
[{"$f":"INDEX(pohjatiedot!$B$3:$B$298,KEHIKKO!$A$5)","v":"KOKO MAA (Manner-Suomi)"}]
[96,"TP 2017","TP 2018",2019,2020,2021,2022,2023,2024,2025,2026,2027,2028]
["TULOSLASKELMA"]
["Asukasluku 31.12.",{"$f":"VLOOKUP($A$4,pohjatiedot!$B$3:$CF$298,2)","v":5483641},{"$f":"VLOOKUP($A$4,pohjatiedot!$B$3:$CF$298,42)","v":5488130},{"$f":"VLOOKUP($A$4,väestöennuste!$A$8:$K$305,4)","v":5537202.9934670329},{"$f":"VLOOKUP($A$4,väestöennuste!$A$8:$K$305,5)","v":5557695.4973222613},{"$f":"VLOOKUP($A$4,väestöennuste!$A$8:$K$305,6)","v":5577842.8704364896},{"$f":"VLOOKUP($A$4,väestöennuste!$A$8:$K$305,7)","v":5597557.1050572991},{"$f":"VLOOKUP($A$4,väestöennuste!$A$8:$K$305,8)","v":5564874},{"$f":"VLOOKUP($A$4,väestöennuste!$A$8:$K$305,9)","v":5584791},{"$f":"VLOOKUP($A$4,väestöennuste!$A$8:$K$305,10)","v":5604290},{"$f":"VLOOKUP($A$4,väestöennuste!$A$8:$K$305,11)","v":5623257},{"$f":"VLOOKUP($A$4,väestöennuste!$A$8:$M$305,12)","v":5623257},{"$f":"VLOOKUP($A$4,väestöennuste!$A$8:$N$305,13)","v":5623257},"Väestöennuste TK 2015"]
["Veroprosentti",{"$f":"VLOOKUP($A$4,pohjatiedot!$B$3:$CF$298,3)","v":19.920000000000002},{"$f":"VLOOKUP($A$4,pohjatiedot!$B$3:$CF$298,43)","v":19.87},{"$f":"VLOOKUP($A$4,pohjatiedot!$B$3:$CI$298,83)","v":19.899999999999999},{"$f":"D8","v":19.899999999999999},{"$f":"E8","v":19.899999999999999},{"$f":"F8","v":19.899999999999999},{"$f":"G8","v":19.899999999999999},{"$f":"H8","v":19.899999999999999},{"$f":"I8","v":19.899999999999999},{"$f":"J8","v":19.899999999999999},{"$f":"K8","v":19.899999999999999},{"$f":"L8","v":19.899999999999999}]
["vero-% yksikön tuotto",{"$f":"B15/B8","v":945165.21084337344},{"$f":"C15/C8","v":939334.07146451937},{"$f":"D15/D8","v":998512.11796678405},{"$f":"E15/E8","v":1031463.0178596878},1071690.0755562154,1107055.8480495706,1141374.5793391073,1176757.1912986194,1213236.6642288766,1250847.0008199716,1289623.2578453906,1329601.5788385975]
[" → noston vaikutus",null,null,{"$f":"(D8-C8)*C9","v":28180.022143933311},{"$f":"(E8-D8)*D9","v":0},{"$f":"(F8-E8)*E9","v":0},0,0,0,0,0,0,0]
["Toimintatuotot (sis. valm. okäytt.)",{"$f":"VLOOKUP($A$4,pohjatiedot!$B$3:$CF$298,6)","v":24653392},{"$f":"VLOOKUP($A$4,pohjatiedot!$B$3:$CF$298,46)","v":25941171},{"$f":"C11*(1+D70/100)","v":26356229.736000001},{"$f":"D11*(1+E70/100)","v":26830641.871248003},{"$f":"E11*(1+F70/100)","v":27367254.708672963},{"$f":"F11*(1+G70/100)","v":27941967.057555094},{"$f":"G11*(1+H70/100)","v":28528748.36576375},29127852.081444785,29739536.975155123,30364067.251633376,31001712.663917676,31652748.629859943,null,"Näiden erin muutos-"]
["Toimintakulut",{"$f":"VLOOKUP($A$4,pohjatiedot!$B$3:$CF$298,7)","v":50758330},{"$f":"VLOOKUP($A$4,pohjatiedot!$B$3:$CF$298,47)","v":52925761},{"$f":"C12*(1+D71/100)","v":54354756.546999998},56202818.269598,{"$f":"E12*(1+F71/100)","v":58057511.272494726},{"$f":"F12*(1+G71/100)","v":59973409.144487046},61892558.23711063,63873120.100698173,65917059.943920515,68026405.862125978,70203250.849714011,72449754.87690486,null,"prosentit syötetään"]
["Osuus osakk.yht. voitoista/tappioista",{"$f":"VLOOKUP($A$4,pohjatiedot!$B$3:$CF$298,8)","v":81900},{"$f":"VLOOKUP($A$4,pohjatiedot!$B$3:$CF$298,48)","v":66298},{"$f":"C13","v":66298},{"$f":"D13","v":66298},{"$f":"E13","v":66298},66298,66298,66298,66298,66298,66298,66298,null,"alla olevaan taulukkoon"]
["Toimintakate",{"$f":"B11-B12+B13","v":-26023038},{"$f":"C11-C12+C13","v":-26918292},{"$f":"D11-D12+D13","v":-27932228.810999997},{"$f":"E11-E12+E13","v":-29305878.398349997},-30623958.563821763,-31965144.086931951,-33297511.87134688,-34678970.019253388,-36111224.968765393,-37596040.610492602,-39135240.185796335,-40730708.247044921]
["Kunnallisverot",{"$f":"VLOOKUP($A$4,pohjatiedot!$B$3:$CF$298,9)","v":18827691},{"$f":"VLOOKUP($A$4,pohjatiedot!$B$3:$CF$298,49)","v":18664568},{"$f":"(C15+D10)*(1+D72/100)","v":19870391.147539001},{"$f":"(D15+E10)*(1+E72/100)","v":20526114.055407785},{"$f":"(E15+F10)*(1+F72/100)","v":21326632.503568687},{"$f":"F15*(1+G72/100)","v":22030411.376186453},{"$f":"(G15+H10)*(1+H72/100)","v":22713354.128848232},23417468.106842525,24143409.618154641,24891855.316317432,25663502.83112327,26459071.418888088]
["Yhteisöverot  ",{"$f":"VLOOKUP($A$4,pohjatiedot!$B$3:$CF$298,10)","v":1887798},{"$f":"VLOOKUP($A$4,pohjatiedot!$B$3:$CF$298,50)","v":1866127},{"$f":"C16*(1+D73/100)","v":1974362.3660000002},{"$f":"D16*(1+E73/100)","v":2039516.3240779999},2133334.074985588,2210134.101685069,2267597.5883288807,2326555.1256254315,2387045.5588916927,2449108.7434228766,2512785.5707518714,2578117.9955914202]
["Kiinteistöverot",{"$f":"VLOOKUP($A$4,pohjatiedot!$B$3:$CF$298,11)","v":1719296},{"$f":"VLOOKUP($A$4,pohjatiedot!$B$3:$CF$298,51)","v":1790525},{"$f":"C17*(1+D74/100)","v":1872889.1500000001},1899109.5981000001,1923798.0228752999,1943036.003104053,1956637.2551257811,1970333.7159116613,1984126.0519230426,1998014.9342865038,2012001.0388265091,2026085.0460982944]
["Verotulot",{"$f":"VLOOKUP($A$4,pohjatiedot!$B$3:$CF$298,12)","v":22434785},{"$f":"VLOOKUP($A$4,pohjatiedot!$B$3:$CF$298,52)","v":22270468},{"$f":"SUM(D15:D17)","v":23717642.663539},24464739.977585785,25383764.601429574,26183581.480975576,26937588.972302891,27714356.948379617,28514581.228969377,29338978.994026814,30188289.440701652,31063274.460577805]
["Valtionosuudet",{"$f":"VLOOKUP($A$4,pohjatiedot!$B$3:$CF$298,13)","v":9699290},{"$f":"VLOOKUP($A$4,pohjatiedot!$B$3:$CF$298,53)","v":9617527},{"$f":"C19*(1+D75/100)","v":9386706.352},{"$f":"D19*(1+E75/100)","v":10447404.169776},{"$f":"E19*(1+F75/100)","v":10614562.636492416},{"$f":"F19*(1+G75/100)","v":11017916.016679129},{"$f":"G19*(1+H75/100)","v":11524740.153446369},11639987.554980833,11756387.430530641,11873951.304835947,11992690.817884307,12112617.726063151]
[null,null,null,"Kuntatalousohjelman (KTO, kevät -19) %-muutokset"]
{"$rows_left_out":99}
{"sheet":"pohjatiedot","index":2,"n_rows":298,"n_cols":102,"rows_kept":298,"cut":false,"hidden":false,"merged":[]}
[null,null,2017,41,42,43,44,45,46,47,48,49,50,51,52,53,54,55,56,57,58,59,60,61,62,null,null,63,64,65,66,67,68,69,70,71,72,73,74,75,76,77,2018,43,44,45,46,47,48,49,50,51,52,53,54,55,56,57,58,59,60,61,62,63,64,65,66,67,68,69,70,71,72,73,74,75,76,77,78,null,80,81,82,"vero-%",84,85,86,87,88,89,90,91,92,93,94,95,96,"2018, rivi 97",2018,99,100,101]
["Kunta nro.","Kunta","Asukasluku ","Veroprosentti",null,null,"Toimintatuotot","Toimintakulut","Osuus osakkuusyhteisöjen voitoista/tappioista","Kunnallisverot","Yhteisöverot","Kiinteistöverot","Verotulot","Valtionavut","Korkotuotot","Korkokulut","Muut rahoitustuotot","Muut rahoituskulut","VUOSIKATE",null,"Poistot ja arvonalent.","Satunnaiset erät, netto",null,"Tlikauden tulos","Tilinpäätössiirrot","Tilikauden verot","Lask. verot","Vähemmintösiirrot",null,"Tlikauden yli-/alijäämä",null,"Kertynyt yli-/alijäämä",null,null,"Nettoinv. 2017","Vuosikate-nettoinv.",null,"Rahavarat ",null,"Lainakanta ",null,null,"Asukasluku","Veroprosentti",null,null,"Toimintatuotot","Toimintakulut","Osuus osakkuusyhteisöjen voitoista/tappioista","Kunnallisverot","Yhteisöverot","Kiinteistöverot","Verotulot","Valtionavut","Korkotuotot","Korkokulut","Muut rahoitustuotot","Muut rahoituskulut","VUOSIKATE",null,"Poistot ja arvonalent.","Satunnaiset erät",null,"Tlikauden tulos","Tilinpäätössiirrot","Tilikauden verot","Lask. verot","Vähemmistöosuudet","Tlikauden yli-/alijäämä",null,"Kertynyt yli-/alijäämä",null,null,"Nettoinv.","Vuosikate-nettoinv.",null,"Rahavarat ",null,"Lainakanta ",null,"Saamiset",null,null,2019,null,null,null,null,null,null,null,null,null,null,null,null,"Kotikuntakorv+elatustuen palautus, netto","Tulorah.korjauserät","Investointimenot","Rahoitusos. inv.menoihin","Inv.hyödyk. luovutustulot","antolainauksen muutokset"]
[20,"Akaa",16769,21.25,null,null,58889,142923,96,54017,1893,3489,59399,32904,385,646,308,164,8248,null,7001,0,null,1247,1,-84,-57,-71,null,1036,null,-6683,null,null,-6028,null,null,6420,null,65864,null,null,16611,21.75,null,null,61885,150217,9,54693,1613,3319,59625,32456,395,462,928,164,4455,null,7026,0,null,-2571,2,-94,-35,-87,-2785,null,-9836,null,null,-8911,null,null,6429,null,71190,null,null,null,null,22.25,null,null,null,null,null,null,null,null,null,null,null,null,null,-12,-9405,130,364,-415]
[5,"Alajärvi",9831,21.75,null,null,54164,112513,114,25065,2438,2156,29659,37946,21,367,218,135,9107,null,5188,0,null,3919,9,-87,-16,-102,null,3723,null,9052,null,null,-9470,null,null,9429,null,41635,null,null,9700,21.75,null,null,56110,116873,190,24613,2142,2138,28893,36755,22,365,172,168,4736,null,5876,0,null,-1140,25,-50,0,-5,-1170,null,7456,null,null,-10578,null,null,8872,null,45721,null,null,null,null,21.75,null,null,null,null,null,null,null,null,null,null,null,null,null,-250,-11309,579,152,16]
[9,"Alavieska",2610,21.5,null,null,14579,30594,1,6494,285,505,7284,9778,0,45,26,17,1010,null,1059,0,null,-49,0,-1,-1,0,null,-51,null,300,null,null,-895,null,null,2257,null,8306,null,null,2573,21.5,null,null,15045,30994,1,6537,259,732,7525,9826,0,29,28,13,1389,null,979,72,null,482,-1,-1,1,-1,480,null,926,null,null,-902,null,null,3048,null,9237,null,null,null,null,22,null,null,null,null,null,null,null,null,null,null,null,null,null,-4,-1137,234,1,0]
[10,"Alavus",11713,21.25,null,null,70759,136082,1545,29789,2699,2730,35218,38629,62,641,816,-57,10255,null,6434,0,null,3821,-4,-18,-30,-31,null,3738,null,20120,null,null,-7415,null,null,17750,null,70327,null,null,11544,21.25,null,null,71741,137803,1547,28747,2398,2756,33798,38294,85,604,761,151,7668,null,6649,0,null,1019,9,-17,-68,-4,939,null,20657,null,null,-8968,null,null,17462,null,71092,null,null,null,null,21.25,null,null,null,null,null,null,null,null,null,null,null,null,null,-1296,-9478,139,371,340]
[16,"Asikkala",8248,20.75,null,null,42592,82843,-3,25298,1616,2787,29701,17513,4,124,246,203,6882,null,4354,64,null,2592,0,-2,-43,0,null,2547,null,9751,null,null,-2560,null,null,4601,null,24863,null,null,8149,20.75,null,null,43453,84756,-6,24509,1436,2893,28838,17538,4,113,69,232,4795,null,4165,263,null,893,0,-13,-59,0,821,null,10527,null,null,-2225,null,null,7673,null,23108,null,null,null,null,20.75,null,null,null,null,null,null,null,null,null,null,null,null,null,-148,-2610,106,279,37]
[18,"Askola",4990,20.75,null,null,15461,39934,-30,16579,1038,1139,18756,7325,0,172,295,53,1648,null,2120,0,null,-472,123,-3,0,0,null,-352,null,-2503,null,null,-3731,null,null,2550,null,24594,null,null,4958,20.75,null,null,14418,41260,-2,16454,949,1144,18547,8957,0,216,302,59,687,null,2089,2228,null,826,178,-6,0,0,998,null,-1633,null,null,-4241,null,null,5260,null,28168,null,null,null,null,21.5,null,null,null,null,null,null,null,null,null,null,null,null,null,-197,-4701,21,439,-1]
[19,"Aura",3991,21.75,null,null,12669,30038,1,13597,745,531,14873,5984,3,65,25,3,3449,null,1306,0,null,2143,0,0,0,-24,null,2119,null,1556,null,null,-1001,null,null,2348,null,14775,null,null,3984,21.75,null,null,12003,31204,1,12992,571,751,14314,6390,0,52,48,25,1475,null,1297,0,null,178,-81,0,-21,-41,35,null,1642,null,null,-2412,null,null,1041,null,14251,null,null,null,null,21.75,null,null,null,null,null,null,null,null,null,null,null,null,null,87,-2336,16,-92,1]
[46,"Enonkoski",1416,21,null,null,10316,19838,0,3723,595,535,4853,5683,27,31,76,5,1082,null,787,-16,null,279,0,0,-36,0,null,243,null,6840,null,null,-1092,null,null,3081,null,1085,null,null,1405,21,null,null,10151,19928,0,3379,569,533,4481,5829,7,14,80,18,588,null,843,5,null,-250,1,-1,-8,0,-258,null,6659,null,null,-802,null,null,3324,null,1082,null,null,null,null,21,null,null,null,null,null,null,null,null,null,null,null,null,null,-15,-907,94,11,-41]
[47,"Enontekiö",1893,21.25,null,null,4225,17496,2,4963,410,830,6203,8824,16,173,616,195,2022,null,1177,-22,null,823,-11,0,-3,0,null,809,null,1400,null,null,-764,null,null,1956,null,10397,null,null,1852,21.25,null,null,8772,22485,-11,5155,384,823,6362,8604,16,137,655,212,1564,null,1111,0,null,453,10,-23,-1,0,439,null,1933,null,null,-744,null,null,2270,null,9399,null,null,null,null,21.25,null,null,null,null,null,null,null,null,null,null,null,null,null,32,-1018,87,187,-84]
[49,"Espoo",279044,18,null,null,1012445,2264850,994,1236961,137156,116153,1490270,84559,11838,55066,42057,2946,319301,null,267979,1200,null,52522,17,-390,-773,-463,null,50913,null,600201,null,null,-521480,null,null,1080286,null,3429679,null,null,283632,18,null,null,1102801,2383893,-1616,1259684,125298,117004,1501986,95314,11822,47412,39012,18089,299925,null,306013,0,null,-6088,12237,-622,2802,3973,12302,null,604643,null,null,-380311,null,null,1004350,null,3502631,null,null,null,null,18,null,null,null,null,null,null,null,null,null,null,null,null,null,-70078,-495489,36891,78287,490]
[50,"Eura",11910,20.5,null,null,36426,99266,0,39017,2303,3077,44397,26168,-13,453,183,186,7256,null,5748,0,null,1508,0,0,-4,30,null,1534,null,5504,null,null,-5760,null,null,5347,null,52506,null,null,11748,20.5,null,null,36008,103147,0,38473,1964,3128,43565,25358,4,381,187,178,1416,null,5804,0,null,-4388,0,0,38,36,-4314,null,1114,null,null,-5657,null,null,5714,null,54266,null,null,null,null,20.5,null,null,null,null,null,null,null,null,null,null,null,null,null,-278,-6341,81,603,256]
[51,"Eurajoki",9521,18,null,null,30898,86250,0,51919,0,0,51919,13352,41,133,1290,454,10663,null,5641,2,null,5024,29,-3,-13,0,null,5037,null,76253,null,null,-7391,null,null,24191,null,17545,null,null,9454,18,null,null,31437,87039,0,28914,2214,19212,50340,11737,1,130,1084,1777,5653,null,5919,0,null,-266,-52,0,-7,1,-324,null,75926,null,null,-3839,null,null,26142,null,16111,null,null,null,null,18,null,null,null,null,null,null,null,null,null,null,null,null,null,49,-5328,16,1473,157]
[52,"Evijärvi",2499,21.5,null,null,7148,23269,0,6674,827,723,8224,8533,94,22,482,34,1156,null,888,0,null,268,-28,-8,-2,-7,null,223,null,3481,null,null,-765,null,null,7504,null,7285,null,null,2473,21.5,null,null,7570,24216,4,6586,639,750,7975,8800,49,28,90,360,-116,null,940,0,null,-1056,-25,-2,-1,-2,-1086,null,2289,null,null,-1366,null,null,7034,null,8210,null,null,null,null,21.5,null,null,null,null,null,null,null,null,null,null,null,null,null,-70,-1537,75,96,16]
[61,"Forssa",17185,20.5,null,null,73061,166862,143,51892,3856,5326,61074,44796,243,763,88,22,11758,null,10896,0,null,862,3,-11,-62,120,null,912,null,25667,null,null,-6959,null,null,19358,null,65801,null,null,17028,20.5,null,null,74139,170963,0,51271,3659,5309,60239,44568,100,759,101,11,7414,null,13797,2000,null,-4383,0,-38,51,108,-4262,null,21404,null,null,-4493,null,null,21948,null,68161,null,null,null,null,20.5,null,null,null,null,null,null,null,null,null,null,null,null,null,-2872,-6742,43,2206,71]
[69,"Haapajärvi",7251,22,null,null,41518,85945,28,19282,1575,1893,22750,26501,20,515,923,279,4898,null,3904,-24,null,970,-3,-80,-4,-99,null,784,null,5116,null,null,-6291,null,null,20153,null,43029,null,null,7147,22,null,null,42556,89443,-77,19358,1560,2243,23059,26347,28,368,960,747,2315,null,4044,310,null,-1419,-6,-88,25,-74,-1562,null,4957,null,null,-1385,null,null,21483,null,42154,null,null,null,null,22.5,null,null,null,null,null,null,null,null,null,null,null,null,null,-228,-2995,70,1540,-925]
[71,"Haapavesi",6970,22,null,null,30893,70568,2,17804,1291,1673,20768,23997,78,362,339,226,4796,null,3611,0,null,1185,-1,-118,-27,2,null,1041,null,214,null,null,-1985,null,null,13134,null,38371,null,null,6854,22,null,null,27937,72355,2,17246,1309,1664,20098,27154,45,373,564,796,2276,null,3641,302,null,-1063,-7,-85,45,22,-1088,null,-173,null,null,-3213,null,null,12695,null,37208,null,null,null,null,22,null,null,null,null,null,null,null,null,null,null,null,null,null,-129,-5182,48,1921,267]
[72,"Hailuoto",967,20,null,null,5176,11532,1,3245,114,332,3691,3733,9,24,92,1,1145,null,674,0,null,471,4,-1,-1,0,null,473,null,7093,null,null,-369,null,null,3536,null,3199,null,null,974,20.5,null,null,5181,12055,0,3032,98,339,3470,3725,6,22,9,4,310,null,681,88,null,-283,-7,0,-1,-1,-292,null,6799,null,null,-1060,null,null,2476,null,2726,null,null,null,null,20.5,null,null,null,null,null,null,null,null,null,null,null,null,null,-198,-1816,6,750,-12]
[74,"Halsua",1171,22,null,null,9263,15712,75,2805,356,551,3712,4155,8,143,29,1,1386,null,844,0,null,542,-7,-4,-3,-2,null,526,null,2010,null,null,-731,null,null,1910,null,14372,null,null,1165,22,null,null,9508,16750,52,2623,432,356,3411,4963,7,137,23,5,1072,null,833,-53,null,186,-35,-8,-2,-3,138,null,2074,null,null,-415,null,null,2201,null,14180,null,null,null,null,22,null,null,null,null,null,null,null,null,null,null,null,null,null,-376,-798,15,368,0]
{"$rows_left_out":279}
{"sheet":"väestöennuste","index":3,"n_rows":303,"n_cols":13,"rows_kept":303,"cut":false,"hidden":false,"merged":[]}
["Väestöennuste 2015 kunnittain 2019-2027"]
["TK, 28.9.2015"]
["2019 kuntajako",2,3,4,5,6,7,8,9,10,11,12,13]
[]
[null,2017,2018,2019,2020,2021,2022,2023,2024,2026,2026,2027,2028]
[null,{"$f":"SUM(B8:B303)","v":10967282},{"$f":"SUM(C8:C303)","v":10976260},11074405.986934066,11115390.994644523,11155685.740872979,11195114.210114598,11121961,11161855,11200909,11238897,11238897,11238897]
["Manner-Suomi",{"$f":"B6-B103","v":5483641},{"$f":"C6-C103","v":5488130},5537202.9934670329,5557695.4973222613,5577842.8704364896,5597557.1050572991,5557087,5577064,5596619,5615640,5615640,5615640]
["Akaa",{"$f":"pohjatiedot!C3","v":16769},{"$f":"pohjatiedot!AQ3","v":16611},17002.311102569103,17036.018295764923,17069.725484073162,17099.467112362385,17184,17218,17248,17275,{"$f":"K8","v":17275},{"$f":"L8","v":17275}]
["Alajärvi",{"$f":"pohjatiedot!C4","v":9831},{"$f":"pohjatiedot!AQ4","v":9700},9669.3661766052246,9598.1005605459213,9530.7940773963928,9462.4977840185165,9697,9629,9560,9499,{"$f":"K9","v":9499},9499]
["Alavieska",{"$f":"pohjatiedot!C5","v":2610},{"$f":"pohjatiedot!AQ5","v":2573},2588.2116848826408,2575.2656549811363,2561.3237690329552,2549.3735820055008,2586,2572,2560,2549,2549,2549]
["Alavus",{"$f":"pohjatiedot!C6","v":11713},{"$f":"pohjatiedot!AQ6","v":11544},11634.312995195389,11556.115966081619,11482.931569933891,11412.754762291908,11527,11454,11384,11319,11319,11319]
["Asikkala",{"$f":"pohjatiedot!C7","v":8248},{"$f":"pohjatiedot!AQ7","v":8149},8247.7377523183823,8228.6712934970856,8212.6153659820557,8200.573399066925,8200,8184,8172,8159,8159,8159]
["Askola",{"$f":"pohjatiedot!C8","v":4990},{"$f":"pohjatiedot!AQ8","v":4958},5193.4068562984467,5237.3360393047333,5281.2652318477631,5319.3372015953064,5365,5410,5449,5490,5490,5490]
["Aura",{"$f":"pohjatiedot!C9","v":3991},{"$f":"pohjatiedot!AQ9","v":3984},4047.191081404686,4065.9509350061417,4081.7487014532089,4099.5211827754974,4118,4134,4152,4168,4168,4168]
["Enonkoski",{"$f":"pohjatiedot!C10","v":1416},{"$f":"pohjatiedot!AQ10","v":1405},1407.2831535339355,1392.3754959106445,1379.4555225372314,1366.5355491638184,1401,1388,1375,1363,1363,1363]
["Enontekiö",{"$f":"pohjatiedot!C11","v":1893},{"$f":"pohjatiedot!AQ11","v":1852},1892.7341923713684,1901.620264172554,1911.4936774969101,1920.3797647953033,1926,1936,1945,1956,1956,1956]
["Espoo",{"$f":"pohjatiedot!C12","v":279044},{"$f":"pohjatiedot!AQ12","v":283632},286232.62782096863,289923.39965820313,293507.74497771263,296972.61272335052,288763,292333,295784,299117,299117,299117]
["Eura",{"$f":"pohjatiedot!C13","v":11910},{"$f":"pohjatiedot!AQ13","v":11748},11891.877452731133,11860.404407143593,11829.914960622787,11797.458437204361,12059,12028,11995,11960,11960,11960]
["Eurajoki",{"$f":"pohjatiedot!C14","v":9521},{"$f":"pohjatiedot!AQ14","v":9454},9466.9534111022949,9485.9031118154526,9500.115404009819,9512.7485070228577,6007,6016,6024,6029,6029,6029]
["Evijärvi",{"$f":"pohjatiedot!C15","v":2499},{"$f":"pohjatiedot!AQ15","v":2473},2468.5978511571884,2451.0208050012589,2433.4437637329102,2415.8667194843292,2510,2492,2474,2458,2458,2458]
{"$rows_left_out":283}