{"text_format":"1","workbook":"xlsx","n_sheets":4,"sheets":["selite","KEHIKKO","pohjatiedot","väestöennuste"],"not_rendered":{"charts":3,"images":0,"macros":0,"external_links":1,"defined_names":3,"comments":0,"pivot_tables":0},"unopened":[],"bounds":{"document_bytes":16777216,"sheet_cells":100000,"rows_first":2000,"rows_last":500,"rows_between":2000,"halvings":0,"cell_chars":16384,"cell_head_chars":4096},"cells_cut":0,"cells_raw":0,"read":"whole","date_system":"1900"}

{"sheet":"selite","index":0,"n_rows":67,"n_cols":2,"rows_kept":67,"cut":false,"hidden":false,"merged":[]}
["VM/KAO/vs"]
[]
["KUNTAKONSERNIN TALOUDEN SUUNNITTELUKEHIKKO"]
["Kuntakonsernin talouden tulevan kehityksen arvioinnin suunnitteluun"]
[]
["Kehikon käyttötarkoitus:"]
["Vuorovaikutteinen kuntakonsernin talouden suunnittelun apuväline. Kehikon avulla voidaan suunnitella konsernin talouden"]
["kehitystä pidemmällä aikavälillä. Tarkastelun kohteena ovat konsernin tuloslaskelma, rahoituslaskelmasta rahavarat, antolainat ja"]
["investoinnit sekä taseesta lainat ja kertynyt yli-/alijäämä. Pohjatietoina kehikossa ovat 2 viimeksi "]
["valmistunutta tilinpäätöstä. "]
[]
["Tulevan kehityksen osalta tuloslaskelman erien kasvuolettamukset pohjautuvat lähtökohtaisesti"]
["uusimman kuntatalousohjelman mukaisiin makroennusteisiin."]
["Käyttäjä voi kuitenkin itse muokata em. muutosolettamuksia sekä muita tuloslaskelman eriä."]
["Myös tuloveroprosenttia, investointeja ja antolainasaamisten määrää voidaan muuttaa."]
{"$rows_left_out":53}
{"sheet":"KEHIKKO","index":1,"n_rows":149,"n_cols":16,"rows_kept":149,"cut":false,"hidden":false,"merged":[]}
["VM/KAO/vs",null,null,null,null,null,null,"VALITSE KUNTA:",null,null,null,"2024-09-30"]
["KUNTAKONSERNIN TALOUDEN SUUNNITTELUKEHIKKO",null,null,null,null,null,null,null,null,"Kunnat vuoden 2023 kuntajaolla"]
["Muokkaa vaaleansinisellä olevia kohtia."]
[{"$f":"INDEX(pohjatiedot!$B$3:$B$296,KEHIKKO!$A$5)","v":"Kyyjärvi"}]
[112,"TP 2022","TP 2023",2024,2025,2026,2027,2028,2029,2030,2031,2032,2033]
["TULOSLASKELMA",1000,1000,1000,1000,1000,1000,1000,1000,1000,1000,1000,1000]
[]
["Asukasluku 31.12.",{"$f":"VLOOKUP($A$4,pohjatiedot!$B$3:$CF$296,2)","v":1196},{"$f":"VLOOKUP($A$4,pohjatiedot!$B$3:$CF$296,42)","v":1174},{"$f":"VLOOKUP($A$4,väestöennuste!$A$7:$J$302,4)","v":1155.6863711001643},{"$f":"VLOOKUP($A$4,väestöennuste!$A$7:$J$302,5)","v":1136.4088669950738},{"$f":"VLOOKUP($A$4,väestöennuste!$A$7:$J$302,6)","v":1119.0591133004925},{"$f":"VLOOKUP($A$4,väestöennuste!$A$7:$J$302,7)","v":1101.7093596059112},{"$f":"VLOOKUP($A$4,väestöennuste!$A$7:$J$302,8)","v":1083.3957307060755},{"$f":"VLOOKUP($A$4,väestöennuste!$A$7:$J$302,9)","v":1065.0821018062397},{"$f":"VLOOKUP($A$4,väestöennuste!$A$7:$J$302,10)","v":1046.768472906404},{"$f":"VLOOKUP($A$4,väestöennuste!$A$7:$J$302,10)","v":1046.768472906404},{"$f":"VLOOKUP($A$4,väestöennuste!$A$7:$L$302,12)","v":1013.0183285940774},{"$f":"VLOOKUP($A$4,väestöennuste!$A$7:$M$302,13)","v":996.55354362142123},null,"Väestöennuste TK 9/2021; toteumakorjattu 2023 tiedoilla"]
["Veroprosentti",{"$f":"VLOOKUP($A$4,pohjatiedot!$B$3:$CF$296,3)","v":22.5},{"$f":"VLOOKUP($A$4,pohjatiedot!$B$3:$CF$296,43)","v":9.86},{"$f":"VLOOKUP($A$4,pohjatiedot!$B$3:$CI$296,83)","v":9.9},{"$f":"D9","v":9.9},{"$f":"E9","v":9.9},{"$f":"F9","v":9.9},{"$f":"G9","v":9.9},{"$f":"H9","v":9.9},{"$f":"I9","v":9.9},{"$f":"J9","v":9.9},{"$f":"K9","v":9.9},{"$f":"L9","v":9.9}]
["vero-% yksikön tuotto",{"$f":"B16/B9","v":160.23461288888888},{"$f":"C16/C9","v":200.07031440162274},{"$f":"D16/D9","v":189.05739319063122},{"$f":"E16/E9","v":198.94666823622569},208.11989009847966,215.9771223264863,224.84069956891733,230.46171705814024,236.22325998459371,242.12884148420852,248.1820625213137,254.38661408434655]
[" → noston vaikutus",null,null,{"$f":"(D9-C9)*C10","v":8.0028125760650948},{"$f":"(E9-D9)*D10","v":0},{"$f":"(F9-E9)*E10","v":0},{"$f":"(G9-F9)*F10","v":0},0,0,0,0,0,0]
["Toimintatuotot ",{"$f":"VLOOKUP($A$4,pohjatiedot!$B$3:$CF$296,6)","v":11207.62342},{"$f":"VLOOKUP($A$4,pohjatiedot!$B$3:$CF$296,46)","v":1920},{"$f":"C12*(1+D72/100)","v":1946.0120258722504},{"$f":"D12*(1+E72/100)","v":1901.7656842999379},{"$f":"E12*(1+F72/100)","v":1927.9920034435906},{"$f":"F12*(1+G72/100)","v":1954.2325692258423},{"$f":"G12*(1+H72/100)","v":1971.2151672009618},1988.3453467068193,2005.6243902508527,2023.0535914856973,2040.6342553060397,2058.3676979463125,null,"Näiden erien muutos-"]
["Toimintakulut",{"$f":"VLOOKUP($A$4,pohjatiedot!$B$3:$CF$296,7)","v":20135.318460000002},{"$f":"VLOOKUP($A$4,pohjatiedot!$B$3:$CF$296,47)","v":5401},{"$f":"C13*(1+D73/100)","v":5523.2280683911868},5891.6236282322052,{"$f":"E13*(1+F73/100)","v":6069.8425796782585},{"$f":"F13*(1+G73/100)","v":6242.3224299772437},6389.2492723007263,6539.6343622936147,6693.5590974511106,6851.1067911382015,7012.3627176838881,7177.4141585368016,null,"prosentit syötetään"]
["Osuus osakk.yht. voitoista/tappioista",{"$f":"VLOOKUP($A$4,pohjatiedot!$B$3:$CF$296,8)","v":0},{"$f":"VLOOKUP($A$4,pohjatiedot!$B$3:$CF$296,48)","v":0},{"$f":"C14","v":0},{"$f":"D14","v":0},{"$f":"E14","v":0},0,0,0,0,0,0,0,null,"alla olevaan taulukkoon"]
["Toimintakate",{"$f":"B12-B13+B14","v":-8927.6950400000023},{"$f":"C12-C13+C14","v":-3481},{"$f":"D12-D13+D14","v":-3577.2160425189363},{"$f":"E12-E13+E14","v":-3989.8579439322675},-4141.8505762346676,-4288.0898607514009,-4418.0341050997649,-4551.2890155867954,-4687.9347072002583,-4828.0531996525042,-4971.7284623778487,-5119.046460590489]
{"$rows_left_out":135}
{"sheet":"pohjatiedot","index":2,"n_rows":296,"n_cols":102,"rows_kept":296,"cut":false,"hidden":false,"merged":[]}
[null,null,2022,3,4,5,6,7,8,9,10,11,12,13,14,15,16,17,18,19,20,21,22,23,24,25,26,27,28,29,30,31,32,33,34,35,36,37,38,39,40,41,2023,43,44,45,46,47,48,49,50,51,52,53,54,55,56,57,58,59,60,61,62,63,64,65,66,67,68,69,70,71,72,73,74,75,76,77,78,null,80,81,82,"vero-%",84,85,86,87,88,89,90,2022,92,93,94,95,96,2023,98,99,100,101]
["Kunta nro.","Kunta","Asukasluku ","Veroprosentti",null,null,"Toimintatuotot","Toimintakulut","Osuus osakkuusyhteisöjen voitoista/tappioista","Kunnallisverot","Yhteisöverot","Kiinteistöverot","Verotulot","Valtionavut","Korkotuotot","Korkokulut","Muut rahoitustuotot","Muut rahoituskulut","VUOSIKATE",null,"Poistot ja arvonalent.","Satunnaiset erät, netto",null,"Tlikauden tulos","Tilinpäätössiirrot","Tilikauden verot","Lask. verot","Vähemmintösiirrot",null,"Tlikauden yli-/alijäämä",null,"Kertynyt yli-/alijäämä",null,null,"Nettoinv. ","Vuosikate-nettoinv.",null,"Rahavarat ",null,"Lainakanta ",null,null,"Asukasluku","Veroprosentti",null,null,"Toimintatuotot","Toimintakulut","Osuus osakkuusyhteisöjen voitoista/tappioista","Kunnallisverot","Yhteisöverot","Kiinteistöverot","Verotulot","Valtionavut","Korkotuotot","Korkokulut","Muut rahoitustuotot","Muut rahoituskulut","VUOSIKATE",null,"Poistot ja arvonalent.","Satunnaiset erät",null,"Tlikauden tulos","Tilinpäätössiirrot","Tilikauden verot","Lask. verot","Vähemmistöosuudet","Tlikauden yli-/alijäämä",null,"Kertynyt yli-/alijäämä",null,null,"Nettoinv.","Vuosikate-nettoinv.",null,"Rahavarat ",null,"Lainakanta ",null,"Saamiset",null,null,2024,null,null,null,null,null,null,null,"Tulorah.korjauserät","Investointimenot","Rahoitusos. inv.menoihin","Inv.hyödyk. luovutustulot","Antolainauksen muutokset","Kotikuntakorv+elatustuen palautus, netto","Tulorah.korjauserät","Investointimenot","Rahoitusos. inv.menoihin","Inv.hyödyk. luovutustulot","antolainauksen muutokset"]
[20,"Akaa",16473,22,null,null,71683.581260000006,173187.90008000002,667.14194999999995,62911.296040000001,2663.49712,3824.35581,69399.148969999995,38886.780200000001,377.10453000000001,1041.5083500000001,555.95384000000001,176.36426999999998,7163.9380499999997,null,7608.3815100000002,24.892669999999999,null,-419.55079000000001,1.2755999999999998,142.22542999999999,-33.408199999999994,-252.44684000000001,null,-846.35566000000006,null,-580.21133000000009,null,null,-9549,null,null,9344.3098100000007,null,109151.71983,null,null,16405,9.36,null,null,9398.5214600000018,52115.260679999999,123.40158,33084.79279,1980.5846999999999,3880.7251200000001,38946.102610000002,12622.80838,519.64599999999996,2288.60752,321.63056,55.105930000000001,7473.1364599999997,null,6919.1013300000004,0,null,554.03512999999998,0.22119999999999998,0.40961000000000003,-3.94,28.33539,578.24211000000003,null,-3425.1219799999999,null,null,null,null,null,179.45281,null,97654.055810000005,null,null,null,null,9.9,null,null,null,null,null,null,null,-811.30905000000007,-27184.646800000002,528.25933999999995,1691.01757,4.7486699999999997,null,-119.79577,-14064.54349,13.2425,164.53005999999999,420]
[5,"Alajärvi",9183,21.75,null,null,73503.042719999998,140554.40445,196.04211999999998,26872.7009,3231.5692000000004,2375.0836200000003,32479.353719999999,41621.538659999998,12.63185,260.45882,322.79467,261.32134000000002,7059.2191299999995,null,6370.9837200000002,0,null,688.23541,0,25.311910000000001,-2.8101100000000003,16.029489999999999,null,676.14287999999999,null,9487.72156,null,null,-10556,null,null,9129.52837,null,45229.486730000004,null,null,9113,9.11,null,null,20092.255410000002,47311.961459999999,132.46233999999998,13866.599310000001,2299.9638399999999,2454.07861,18620.641760000002,17437.39241,45.403150000000004,524.75118999999995,204.5805,21.580459999999999,8674.4424600000002,null,5022.6077000000005,0,null,3651.8347599999997,0,33.713889999999999,2.8704000000000001,8.8975000000000009,3629.88877,null,13315.98142,null,null,null,null,null,8314.0888599999998,null,30309.26426,null,null,null,null,9.1,null,null,null,null,null,null,null,-421.67471999999998,-5728.4627499999997,401.59066999999999,473.38396999999998,9.4525699999999997,null,-193.74161999999998,-3050.9133400000001,7.8563900000000002,110.55450999999999,48.217199999999998]
[9,"Alavieska",2447,22,null,null,17797.693850000003,35441.338619999995,3.8393899999999999,7872.1357300000009,442.59866999999997,783.89562000000001,9098.6300199999987,11441.820460000001,362.04586,49.856540000000003,34.825470000000003,221.95541,2997.4611199999999,null,1173.77602,0,null,1823.6851000000001,-2.4397899999999999,1.0835699999999999,-2.6600000000000002E-2,-0.61714000000000002,null,1819.518,null,5512.2818499999994,null,null,-1629,null,null,7551.13969,null,13563.918800000001,null,null,2437,9.36,null,null,3988.9176499999999,11747.910599999999,12.066240000000001,3888.28253,256.39553000000001,786.91356000000007,4931.5916200000001,4520.2201500000001,30.93572,243.79504999999997,246.18260000000001,59.81006,1670.52621,null,1247.41443,-10.54,null,412.57178000000005,1.29386,3.5845799999999999,0,0,410.28106000000002,null,5893.3795300000002,null,null,null,null,null,5316.2270499999995,null,9042.18649,null,null,null,null,9.3000000000000007,null,null,null,null,null,null,null,32.47007,-2380.2151699999999,6.8373599999999994,66.484210000000004,-181.2,null,-12.416799999999999,-1982.62184,25.147740000000002,47.236359999999998,6.3]
[10,"Alavus",11102,21.25,null,null,83034.939939999997,158446.12218999999,578.37410999999997,30819.23618,4217.3695800000005,2722.9732000000004,37759.578959999999,45138.767,35.014559999999996,534.14821999999992,926.75397999999996,1771.51469,6609.5277100000003,null,8271.5507899999993,0,null,-1662.0230800000002,19.38,14.484639999999999,-34.455059999999996,28.142869999999998,null,-1663.4399099999998,null,23149.482379999998,null,null,-2931,null,null,30658.56205,null,89987.110780000003,null,null,10933,8.61,null,null,18086.034920000002,44951.001349999999,661.18295000000001,15177.962680000001,2552.0279799999998,3162.5322500000002,20892.52291,12378.599,58.172330000000002,1617.7236699999999,1587.6964499999999,140.67607999999998,6816.57521,null,7360.6696700000002,-221.17342000000002,null,-765.26787999999999,10,13.119399999999999,-13.438000000000001,2.9853200000000002,-778.83996000000002,null,23125.215119999997,null,null,null,null,null,30138.606219999998,null,79302.655979999996,null,null,null,null,9.6,null,null,null,null,null,null,null,-807.97438,-11838.00359,463.78228999999999,468.60924,251.50908999999999,null,-1242.28234,-11953.5674,884.25893999999994,2762.9071400000003,102.04414]
[16,"Asikkala",8014,20.75,null,null,48764.511060000004,102135.31515000001,-16.533049999999999,27954.874670000001,2546.5694900000003,3099.1713500000001,33600.615509999996,25532.793719999998,-19.522479999999998,58.843650000000004,630.09312,134.28413,6122.9716600000002,null,3580.5704300000002,-13.672120000000001,null,2528.7291099999998,-0.52194000000000007,-2.8000000000000003E-4,-4.4350899999999998,0.69516,null,2524.4675200000001,null,23193.11922,null,null,-3897,null,null,5604.3059800000001,null,20242.09446,null,null,7968,8.11,null,null,8786.0314299999991,31668.344300000001,4.28627,13354.66186,1596.22371,3182.3204700000001,18133.206039999997,12731.768119999999,243.69968,355.02100999999999,106.78177000000001,113.09569999999999,7824.5950999999995,null,3728.2835399999999,-2.24735,null,4094.06421,-1.04226,0,-52.930599999999998,0,4040.0913500000001,null,27444.24481,null,null,null,null,null,2557.03325,null,14864.742020000002,null,null,null,null,8.1,null,null,null,null,null,null,null,671.0548,-17787.586629999998,83.225970000000004,121.61186000000001,14.374499999999999,null,687.74229000000003,-12941.977000000001,480.54323999999997,4725.9539800000002,0]
[18,"Askola",4763,21.5,null,null,19409.226549999999,47234.529040000001,-175.72783999999999,20014.208589999998,1652.8688300000001,1253.31005,22920.387469999998,8769.3430000000008,19.840949999999999,233.04207,438.13826,690.48506999999995,3223.1522099999997,null,2154.83716,0,null,1068.3150500000002,-128.66480999999999,11.68155,0,0.57530999999999999,null,928.54399999999998,null,7338.8859900000007,null,null,-4349,null,null,10351.80898,null,28251.469130000001,null,null,4700,8.86,null,null,8450.6453799999999,21191.74986,-73.283829999999995,9421.46738,1152.64824,1285.2098899999999,11859.325510000001,3522.4180000000001,62.037790000000001,599.36077,780.01604000000009,449.15625,2360.8920099999996,null,1905.62114,0,null,455.27087,-4.9642400000000002,18.415839999999999,0,0,431.89078999999998,null,13359.798889999998,null,null,null,null,null,8489.0090999999993,null,22892.62717,null,null,null,null,8.9,null,null,null,null,null,null,null,-182.34356,-1902.26423,5.1803599999999994,208.99598999999998,2.3582800000000002,null,-56.818849999999998,-1236.0499399999999,-0.99360000000000004,96.396600000000007,0]
[19,"Aura",3965,21.5,null,null,13741.87658,36512.070540000001,-5.2591800000000006,14935.18036,872.98568999999998,885.76715000000002,16693.933199999999,7963.9655700000003,6.3792600000000004,94.00658,71.577219999999997,23.420259999999999,1842.9752699999999,null,1429.92283,0,null,413.05243999999999,-83.826630000000009,0.14141000000000001,-20.323400000000003,-38.768149999999999,null,269.99284999999998,null,5776.9669399999993,null,null,-1210,null,null,3672.933,null,11852.531989999999,null,null,3961,8.86,null,null,3715.4181100000001,14438.434439999999,-0.27964,7361.4130800000003,630.30621999999994,913.92156999999997,8905.6408699999993,3574.93694,4.6663100000000002,128.72055,31.51962,17.736249999999998,1647.01097,null,1015.92416,85.935820000000007,null,717.02263000000005,-94.237820000000013,2.1989999999999999E-2,-21.398,-43.025199999999998,558.33961999999997,null,6345.9692599999998,null,null,null,null,null,1156.865,null,8378.3371399999996,null,null,null,null,8.9,null,null,null,null,null,null,null,-18.614650000000001,-3111.0809800000002,67.231399999999994,43.887910000000005,0,null,-94.022790000000001,-1332.75368,38.19,567.03694999999993,-0.59325000000000006]
[46,"Enonkoski",1341,21,null,null,11315.894490000001,21512.980079999998,0,3683.7084399999999,905.87333999999998,567.66114000000005,5157.2429199999997,6663.5733600000003,14.009540000000001,29.105820000000001,103.86591,37.221029999999999,1675.2792899999999,null,811.87175999999999,26.982310000000002,null,890.38983999999994,0,0,0.79634000000000005,0,null,891.18618000000004,null,10315.152,null,null,-666,null,null,7132.8191100000004,null,1865.1834199999998,null,null,1320,8.36,null,null,2025.1452400000001,6369.8621499999999,0,1757.7245399999999,549.5783100000001,582.96794,2890.27079,2543.7663399999997,112.42671,1.49925,140.69376,11.342309999999999,1313.31872,null,659.04062999999996,11.104100000000001,null,665.38218999999992,0,0.43995999999999996,13.479200000000001,0,678.4214300000001,null,10714.96054,null,null,null,null,null,6749.12039,null,90.588269999999994,null,null,null,null,8.4,null,null,null,null,null,null,null,-22.312669999999997,-1768.9834099999998,1.04718,4.4403800000000002,-1.6676300000000002,null,-17.160319999999999,-654.66069999999991,0,14.56395,-64.792910000000006]
[47,"Enontekiö",1811,21.25,null,null,9062.6685699999998,25408.877789999999,-13.682259999999999,5393.1741600000005,887.71537000000001,898.60772999999995,7179.4972600000001,9856.3070000000007,5.2221200000000003,49.652239999999999,2717.1296200000002,211.04242000000002,3137.5698600000001,null,1419.1289400000001,0.13033,null,1718.57125,0.47181000000000001,7.6489999999999989E-2,1.0000000000000001E-5,0.92752999999999997,null,1719.8941100000002,null,12766.422329999999,null,null,-1671,null,null,10625.58972,null,8982.4487599999993,null,null,1771,8.61,null,null,5092.2469199999996,12442.472960000001,-3.8234299999999997,3032.2939300000003,592.20650999999998,1005.2551500000001,4629.7555899999998,3700.0889400000001,5.7561800000000005,24.978680000000001,906.80556999999999,225.95928000000001,1637.41885,null,854.71647999999993,-9.5500000000000012E-3,null,782.69281999999998,0,2.3614499999999996,1.0000000000000001E-5,0,780.33137999999997,null,13670.5569,null,null,null,null,null,7114.4779699999999,null,3059.0958499999997,null,null,null,null,8.6,null,null,null,null,null,null,null,-446.57779999999997,-3215.1745000000001,159.71143000000001,434.24690999999996,0,null,-203.93780999999998,-1987.10673,258.64132999999998,209.38749999999999,1.7077800000000001]
[49,"Espoo",305274,18,null,null,1302140.21734,2890664.2640200001,-5194.7349299999996,1484705.5996900001,223623.01793999999,141816.92977000002,1850145.5474,233835.42130000002,11102.23983,43976.163810000005,31007.756819999999,50700.078009999997,437695.94193000003,null,348501.37810000003,136732.25996,null,225926.82378999999,2169.8645000000001,1498.0436499999998,-3253.9895899999997,4741.8296200000004,null,228086.48465999999,null,1001713.6867899999,null,null,-508527,null,null,1660271.5561800001,null,4396400.9351499993,null,null,314024,5.3600000000000012,null,null,800948.20535000006,1579872.6102,3184.20426,615847.31613000005,152479.9431,143060.23103,911387.49025999999,427492.31962999998,16240.95743,78310.590500000006,60207.879909999996,5089.1097,556188.74644000002,null,361111.02724000002,0,null,195077.71919999999,48.349129999999995,-1341.8470300000001,1234.6593899999998,7985.0048799999995,205687.57962999999,null,1215298.3387,null,null,null,null,null,1403823.8617799999,null,3854006.5495699998,null,null,null,null,5.3,null,null,null,null,null,null,null,-194939.74797,-536892.78671000001,14994.35678,201209.00850999999,2849.8688999999999,null,-77803.05812999999,-375188.33918999997,6333.0618299999996,77793.049819999986,2442.9889199999998]
[50,"Eura",11276,21,null,null,41041.618490000001,116085.28831,0,41188.585129999999,3721.3295800000001,3291.71018,48201.624889999999,30662.84087,6.0182600000000006,410.24446999999998,203.92233999999999,104.30786000000001,3516.1842099999999,null,6346.8178899999994,0,null,-2830.6336800000004,-26.805679999999999,19.915290000000002,-30.842929999999999,-7.6264200000000004,null,-2915.8240000000001,null,617.60347999999999,null,null,-9291,null,null,4862.4349099999999,null,56441.63377,null,null,11184,8.36,null,null,13423.13444,42867.322759999995,0,20217.262549999999,2537.2622299999998,3388.5784800000001,26143.10326,10603.653329999999,25.695499999999999,1150.3295000000001,298.96709000000004,80.497179999999986,6396.4041799999995,null,5907.7361000000001,0,null,488.66808000000003,-32.976730000000003,15.731249999999999,40.358379999999997,11.131930000000001,491.45040999999998,null,1558.3018099999999,null,null,null,null,null,3405.0880999999999,null,54034.355410000004,null,null,null,null,8.9999999999999982,null,null,null,null,null,null,null,51.782150000000001,-6999.5005799999999,42.461269999999999,277.91459000000003,-112.71462,null,-55.631320000000002,-6485.2301900000002,0,306.72009000000003,55.946339999999999]
[51,"Eurajoki",9211,18,null,null,48592.522499999999,116093.0116,0,32211.778719999998,3424.6581900000001,23840.874640000002,59477.311549999999,14126.654,33.437069999999999,127.8112,290.02051,359.30425000000002,5939.8185800000001,null,5074.4564199999995,0,null,865.36216000000002,0.51100000000000001,2.1946699999999999,2.5276799999999997,0.21759000000000001,null,866.42376000000002,null,78148.115480000008,null,null,-4781,null,null,31590.74409,null,13757.90134,null,null,9143,5.36,null,null,8738.8083499999993,37980.679090000005,0,11935.331550000001,2894.2556400000003,25315.194760000002,40144.781950000004,-3955.5070000000001,67.193089999999998,300.62432000000001,627.47304000000008,6.1099399999999999,7335.33608,null,4333.4667199999994,0,null,3001.8693599999997,20.300609999999999,0,-14.198120000000001,0,3007.9718499999999,null,81278.180290000004,null,null,null,null,null,23403.89688,null,9009.2644600000003,null,null,null,null,5.4,null,null,null,null,null,null,null,277.36070000000001,-3654.1987300000001,66.618499999999997,71.799419999999998,0,null,590.40109999999993,-11474.102570000001,647.00459999999998,436.56251000000003,0]
[52,"Evijärvi",2346,22.5,null,null,8343.4381599999997,26272.490160000001,2.49411,7326.3812300000009,1041.11068,795.55092000000002,9163.0428300000003,10579.25332,77.590279999999993,99.761990000000011,329.22615999999999,458.45677000000001,1664.3359399999999,null,1230.63534,0,null,433.70059999999995,-11.981,6.4760200000000001,0.93764000000000003,6.0354200000000002,null,422.21664000000004,null,1829.79594,null,null,-1945,null,null,9033.6362599999993,null,13191.644609999999,null,null,2292,9.86,null,null,2734.3961400000003,10080.97401,0,3690.80053,692.74706999999989,833.69174999999996,5217.2393499999998,4359.4899100000002,69.792389999999997,258.09942999999998,444.61142999999998,201.98854,2284.4672400000004,null,1012.39067,0,null,1272.0765700000002,-6.72,4.9012000000000002,0,-8.150000000000001E-3,1260.44722,null,3175.9147199999998,null,null,null,null,null,8163.36049,null,8848.2531799999997,null,null,null,null,9.8000000000000007,null,null,null,null,null,null,null,-25.757369999999998,-1529.55798,198.09232999999998,1.4845200000000001,15.365440000000001,null,-12.169030000000001,-1372.75055,55,-3.4978699999999998,49.615449999999996]
{"$rows_left_out":282}
{"sheet":"väestöennuste","index":3,"n_rows":300,"n_cols":13,"rows_kept":300,"cut":false,"hidden":false,"merged":[]}
["Väestöennuste 2019 kunnittain 2021-2029"]
["TK, Syyskuu 2019"]
["2021 kuntajako",2,3,4,5,6,7,8,9,10,11,12,13]
[]
[null,2022,2023,2024,2025,2026,2027,2028,2029,2030,2031,2032,2033]
[]
["Akaa",{"$f":"pohjatiedot!AQ3","v":16405},16353,16285.210634712601,16171.564313798914,16066.108718716845,15966.796168008488,15871.57898021594,15781.480996068152,15691.383011920365,15592.006616041201,15493.259589036052,15395.137944996834]
["Alajärvi",{"$f":"pohjatiedot!AQ4","v":9113},9472,8999.3891218005301,8888.7944616063542,8777.1943954104154,8667.6051412180059,8558.0158870255964,8452.4482568402473,8351.907656663725,8248.4981841484223,8146.3690800765326,8045.5044915159115]
["Alavieska",{"$f":"pohjatiedot!AQ5","v":2437},2496,2413.078527607362,2389.1570552147241,2367.2290388548058,2344.3042944785279,2321.3795501022496,2300.4482617586914,2277.523517382413,2255.6096563497808,2233.9066459633405,2212.4124574617099]
["Alavus",{"$f":"pohjatiedot!AQ6","v":10933},11253,10806.104459879363,10677.210564796198,10553.312557119356,10434.410436848839,10316.507494059586,10204.599616157922,10091.692560774994,9976.9117731998977,9863.4364781491731,9751.2518272255675]
["Asikkala",{"$f":"pohjatiedot!AQ7","v":7968},8032,7922.7900643046269,7873.5614676585546,7827.3468667255065,7779.1229353171093,7734.9176648594121,7692.7217248770639,7653.5397806077408,7609.6421234925983,7565.9962458619084,7522.6007036087876]
["Askola",{"$f":"pohjatiedot!AQ8","v":4700},4947,4671.383581776191,4646.7142557211837,4624.0184757505767,4603.2962418643701,4580.6004618937632,4557.9046819231562,4537.1824480369505,4514.3884367994015,4491.7089386885,4469.1433784103228]
["Aura",{"$f":"pohjatiedot!AQ9","v":3961},3973,3964.0015155342257,3969.0040414246023,3975.0070724930538,3984.0116190957315,3990.0146501641834,3994.0166708764841,3997.0181864107103,4002.1907945718972,4007.3700966919159,4012.5561014335303]
["Enonkoski",{"$f":"pohjatiedot!AQ10","v":1320},1369,1307.0685757347401,1293.1424265259984,1280.2110022607385,1267.2795779954786,1252.3587038432554,1239.4272795779955,1223.5116804822908,1210.3165053728628,1197.2636359307578,1184.3515374356871]
["Enontekiö",{"$f":"pohjatiedot!AQ11","v":1771},1849,1764.0393037619315,1758.0729927007301,1751.1122964626616,1743.1572150477261,1735.2021336327907,1725.2582818641215,1716.3088152723192,1708.6353709538748,1700.9962338342191,1693.3912505293122]
{"$rows_left_out":285}