{"text_format":"1","workbook":"xlsx","n_sheets":2,"sheets":["Kuntakortti","Luvut"],"not_rendered":{"charts":0,"images":0,"macros":1,"external_links":0,"defined_names":2,"comments":0,"pivot_tables":0},"unopened":[],"bounds":{"document_bytes":16777216,"sheet_cells":100000,"rows_first":2000,"rows_last":500,"rows_between":2000,"halvings":0,"cell_chars":16384,"cell_head_chars":4096},"cells_cut":0,"cells_raw":0,"read":"whole","date_system":"1900"}

{"sheet":"Kuntakortti","index":0,"n_rows":79,"n_cols":15,"rows_kept":79,"cut":false,"hidden":false,"merged":[[1,6,1,7]]}
["Valtiovarainministeriö/Kunta- ja aluehallinto-osasto,1.6.2021"]
["KUNTAKONSERNIEN TP 2018 - 2020 (lyhennetty kaava)",null,null,null,null,null,"Valitse kunta valikosta:"]
[null,null,null,null,null,null,null," "]
[{"$f":"INDEX(Luvut!$B$3:'Luvut'!$B$297,$A$7)","v":"KOKO MAA (Manner-Suomi)"},null,null,2018,null,null,2019,null,null,2020]
[]
["Asukasluku",null,null,{"$f":"VLOOKUP($A$4,Luvut!$B$3:$AV$297,2)","v":5488130},null,null,{"$f":"VLOOKUP($A$4,Luvut!$B$3:$EJ$297,48)","v":5495408}," ",{"$f":"((G6/D6)-1)*100","v":0.13261347672157697},{"$f":"VLOOKUP($A$4,Luvut!$B$3:$EJ$297,94)","v":5503664}," ",{"$f":"((J6/G6)-1)*100","v":0.15023452307818541}]
[96,null,null," "]
["Tunnuslukuja",null,null," "]
[null,null,null," "," "," "," ",null,"muut.%"," ",null,"muut.%"]
["Lainat, euro/as",null,null,{"$f":"E66","v":6557.6498734541638}," ",null,{"$f":"H66","v":7105.3242998518035},null,{"$f":"((G10/D10)-1)*100","v":8.3516875247436673},{"$f":"K66","v":7480.9228906415801},null,{"$f":"((J10/G10)-1)*100","v":5.2861569006443565}]
[]
["Lainanhoitokate*",null,null,{"$f":"VLOOKUP($A$4,Luvut!$B$3:$AV$297,4)","v":1.5263679823177443}," ",null,{"$f":"VLOOKUP($A$4,Luvut!$B$3:$EJ$297,50)","v":1.3569511103880256},null,null,{"$f":"VLOOKUP($A$4,Luvut!$B$3:$EJ$297,96)","v":1.9824288535921184}]
["Suhteellinen velkaantuneisuus, %",null,null,{"$f":"VLOOKUP($A$4,Luvut!$B$3:$AV$297,5)","v":80.756103243819908}," ",null,{"$f":"VLOOKUP($A$4,Luvut!$B$3:$EJ$297,51)","v":84.447330372951342},null,null,{"$f":"VLOOKUP($A$4,Luvut!$B$3:$EJ$297,97)","v":84.264663756429755}]
["Rahoitusvarallisuus, euro/as",null,null,{"$f":"VLOOKUP($A$4,Luvut!$B$3:$AV$297,6)","v":-6400.7277524402662}," ",null,{"$f":"VLOOKUP($A$4,Luvut!$B$3:$EJ$297,52)","v":-6908.8508078017139},null,null,{"$f":"VLOOKUP($A$4,Luvut!$B$3:$EJ$297,98)","v":-7091.1732620305311}]
["Omavaraisuusaste, %",null,null,{"$f":"VLOOKUP($A$4,Luvut!$B$3:$AV$297,10)","v":42.443907732165421},null,null,{"$f":"VLOOKUP($A$4,Luvut!$B$3:$EJ$297,56)","v":41.859037258543488},null,null,{"$f":"VLOOKUP($A$4,Luvut!$B$3:$EJ$297,102)","v":42.051979561336196}]
{"$rows_left_out":65}
{"sheet":"Luvut","index":1,"n_rows":297,"n_cols":178,"rows_kept":297,"cut":false,"hidden":false,"merged":[]}
[null,null,2018,"hakee muualta",92,93,94,"vanha",96,97,98,99,100,101,102,103,104,null,105,106,107,108,"summana",110,111,112,113,114,115,116,null,117,118,119,120,121,122,"kaavasta",124,125,126,127,128,129,130,131,"kaavasta",133,2019,"hakee muualta",92,93,94,"vanha",96,97,98,99,100,101,102,103,104,null,105,106,107,108,"summana",110,111,112,113,114,115,116,117,null,118,119,120,121,122,"kaavasta",124,125,126,127,128,129,130,131,"kaavasta",133,2020,"hakee muualta",92,93,94,"vanha",96,97,98,99,100,101,102,107,108,109,110,111,112,113,"summana",115,116,117,118,119,120,121,122,123,124,125,126,127,128,"kaavasta",130,131,132,133,134,135,136,137,"kaavasta",139,"Erillistiedot",141,142,143,144,145,2018,147,148,2019,150,151,2020,153,154,2018,156,2019,158,2020,160,2018,162,163,164,2019,166,167,168,2020,170,171,172,2018,2019,2020,2019,2020]
["Kunta nro","Kunta","Asukasluku ","Lainat e/asukas","Lainanhoitokate","Suhteellinen velkaantuneisuus-%","Rahoitusvarallisuus, e/as","Vuosikate","Suunnitelman mukaiset poistot","Tilikauden tulos","Omavaraisuusaste, %","Rahavarat e/as","Kassan riittävyys, pv","Kassasta maksut, €/as","Henkilöstökulut","Toimintatuotot","Toimintakulut","Osuus osakkuusyhteisojen voitosta/tappiosta","Toimintakate","Verotulot","Valtionosuudet","Alv-takaisinperintä","Käyttökate","Korkotuotot/-menot, netto","Muut rahoitustuotot/-menot, netto (sis Osinkotuotot)","Vuosikate","Suunnitelman mukaiset poistot ja arvonalet","Satu. erät, netto","Satunnaiset kulut","Tilikauden tulos","Vähemmistöosuudet","Tilinpäätössiirrot","Tilikauden verot","Lask. Verot","Tilikauden yli- tai alijäämä","Kumulat yli/alij","Tulorah (toiminnan rahavirta)","Investoinnit, netto","Saamisten muutos (ent Pitkäaikaisten saamisten muutokset, netto)","Pitkäaikaisten lainojen vähennys","Toim ja inv rahavirta","Verotulot","Kunnallisvero","Osuus yhteisöveron tuotosta","Kiinteistövero","Tuloveroprosentti 2015","Yhden veroprosentin tuotto 2015","Sijoitus vuosikatteen mukaan","Asukasluku ","Lainat e/asukas","Lainanhoitokate","Suhteellinen velkaantuneisuus-%","Rahoitusvarallisuus, e/as","Vuosikate","Suunnitelman mukaiset poistot","Tilikauden tulos","Omavaraisuusaste, %","Rahavarat e/as","Kassan riittävyys, pv","Kassasta maksut, €/as","Henkilöstökulut","Toimintatuotot","Toimintakulut","Osuus osakkuusyhteisojen voitosta/tappiosta","Toimintakate","Verotulot","Valtionosuudet","Alv-takaisinperintä","Käyttökate","Korkotuotot/-menot, netto","Muut rahoitustuotot/-menot, netto (sis Osinkotuotot)","Vuosikate","Suunnitelman mukaiset poistot ja arvonalet","Satu. erät, netto",null,"Tilikauden tulos","Vähemmistöosuudet","Tilinpäätössiirrot","Tilikauden verot","Lask. verot","Tilikauden yli- tai alij.","Kumulat yli/alij","Toiminnan rahavirta","Investoinnit, netto","Saamisten muutos ","Pitkäaikaisten lainojen vähennys","Toim ja inv rahavirta","Verotulot","Kunnallisvero","Osuus yhteisöveron tuotosta","Kiinteistövero","Tuloveroprosentti 2019","Yhden veroprosentin tuotto 2016","Sijoitus vuosikatteen mukaan","Asukasluku","Lainat e/asukas","Lainanhoitokate","Suhteellinen velkaantuneisuus-%","Rahoitusvarallisuus, e/as","Vuosikate","Suunnitelman mukaiset poistot","Tilikauden tulos","Omavaraisuusaste, %","Rahavarat e/as","Kassan riittävyys, pv","Kassasta maksut, €/as","Henkilöstökulut","Toimintatuotot","Toimintakulut","Osuus osakkuusyhteisojen voitosta/tappiosta","Toimintakate","Verotulot","Valtionosuudet","Alv-takaisinperintä","Käyttökate","Korkotuotot/-menot, netto","Muut rahoitustuotot/-menot, netto (sis Osinkotuotot)","Vuosikate","Suunnitelman mukaiset poistot ja arvonalet","Satu. erät","Satu. kulut","Tilikauden tulos","Vähemmistöosuudet","Tilinpäätössiirrot","Tilikauden verot","Lask. verot","Tilikauden yli- tai alijäämä","Kumulat yli/alij","Toiminnan rahavirta","Investoinnit, netto","Saamisten muutos ","Pitkäaikaisten lainojen vähennys","Toim ja inv rahavirta","Verotulot","Takaukset muiden puolesta (jäljellä oleva pääoma)","Osuus yhteisöveron tuotosta","Kiinteistövero","Tuloveroprosentti 2020","Yhden veroprosentin tuotto 2006","Sijoitus vuosikatteen mukaan","Palvelujen ostot 2018","Palvelujen ostot 2019","Palvelujen ostot 2020","Harkvar2018","Harkvar2019","Harkvar2020"," - Investointimenot"," + Rahoitusos. investointimenoihin"," + Investointihyödykk. luovutustulot"," - Investointimenot"," + Rahoitusosuudet investointimenoihin"," + Investointihyödykkeiden luovutustulot"," - Investointimenot"," + Rahoitusosuudet investointimenoihin"," + Investointihyödykkeiden luovutustulot","Pitkäaikaisten lainojen lisäys"," ± Lyhytaikaisten lainojen muutos","Pitkäaikaisten lainojen lisäys"," ± Lyhytaikaisten lainojen muutos","Pitkäaikaisten lainojen lisäys"," ± Lyhytaikaisten lainojen muutos","Lainakanta","josta pitkäaik","josta lyhytaik","Lainasaamiset","Lainakanta","josta pitkäaik","josta lyhytaik","Lainasaamiset","Lainakanta","josta pitkäaik","josta lyhytaik","Lainasaamiset","Takaukset muiden puolesta (jäljellä oleva pääoma)","Takaukset muiden puolesta (jäljellä oleva pääoma)","Takaukset muiden puolesta (jäljellä oleva pääoma)","Vuokravastuut","Vuokravastuut"]
[20,"Akaa",16611,null,0.69020213363279059,61.743501812088383,-4767.322858346879,null,null,null,18.920032976092333,387.03268918186745,14.023695691149227,10073.44530732647,null,61885,150217,9,-88323,59625,32456,null,null,-67,764,4455,7026,0,null,-2571,-87,2,-94,-35,-2785,-9933,4350,null,-1160,-6662,-4561,null,null,null,null,21.75,null,233,16475,null,1.3448478612376893,60.55128197194081,-4926.6767830045519,null,null,null,19.358001880125773,430.28831562974199,13.814818085482161,10310.166919575113,null,64620,153015,-4,-88399,62993,33974,null,null,-80,227,8715,8464,0,null,251,-102,0,70,-43,36,-9892,7916,null,-198,-6369,-1633,null,null,null,null,22.25,null,112,16391,null,11.406287787182588,56.0820333898873,-4964.1266548715757,null,null,null,23.590750124901863,803.73375632969316,25.097131464122427,11689.097675553658,null,84365,170341,531,-85445,64150,39506,null,null,-147,338,18402,8763,0,null,9639,-409,0,227,-18,8985,-1092,15626,null,-1427,-1190,258,null,null,null,null,22.25,null,98,null,null,null,null,null,null,-9405,130,364,-9837,35,253,-19500,115,4017,12126,-139,3804,4960,16451,-13511,71138,54488,16650,7687,73531,52049,21482,7682,75779,62285,13494,-1427,6892,11897,14631,12541,15695]
[5,"Alajärvi",9700,null,0.93271164746754431,52.878660950409831,-4758.0412371134025,null,null,null,33.057348584433676,914.63917525773195,24.198955305300444,13795.773195876289,null,56110,116873,190,-60573,28893,36755,null,null,-343,4,4736,5876,0,null,-1140,-5,25,-50,0,-1170,7456,4436,null,892,-5104,-6142,null,null,null,null,21.75,null,148,9562,null,0.78123254514987894,51.263742656040954,-5599.0378581886634,null,null,null,31.606193054146559,801.50596109600508,21.480130275874419,15766.262288224221,null,71516,133738,226,-61996,29512,36500,null,null,-377,164,3803,6114,0,null,-2311,7,-11,48,-5,-2368,4891,3486,null,338,-4978,-7070,null,null,null,null,21.75,null,162,9419,null,1.4540717582253981,50.949560810329857,-5587.2173266801146,null,null,null,33.041555581841841,1021.5521817602718,23.937933666862058,15576.388151608451,null,70222,131111,113,-60776,29583,40681,null,null,-373,273,9388,6287,0,null,3101,29,-21,64,-15,3030,7816,8946,null,213,-6338,427,null,null,null,null,21.75,null,133,null,null,null,null,null,null,-11309,579,152,-11425,781,88,-8822,275,28,7075,2000,9888,0,7058,64,45721,35494,10227,115,50397,39206,11191,0,51214,40348,10866,213,808,626,498,1338,1380]
[9,"Alavieska",2573,null,2.1007407407407408,40.653167057661442,-3263.8942868247182,null,null,null,38.78576602680188,1184.6094053633892,33.898656266187274,12755.149630781189,null,15045,30994,1,-15948,7525,9826,null,null,-29,15,1389,979,72,null,482,-1,-1,-1,1,480,926,1456,null,415,-646,554,null,null,null,null,21.5,null,127,2519,null,3.8731182795698924,40.471348247398012,-3265.1845970623262,null,null,null,40.241119483315394,1269.1544263596666,32.959649226758309,13399.76181024216,null,15791,31650,1,-15858,7960,9685,null,null,-27,14,1774,1068,0,null,706,0,0,1,0,705,1631,1775,null,-385,-438,146,null,null,null,null,22,null,56,2517,null,0.59001512859304084,41.539116853613514,-3014.700039729837,null,null,null,41.55028477802918,2144.6166070719109,49.98782189521755,15659.515295987287,null,16575,32888,1,-16312,7712,10928,null,null,10,12,2350,1045,0,null,1305,0,-3,0,-1,1301,2931,2477,null,468,-3976,1193,null,null,null,null,22,null,165,null,null,null,null,null,null,-1137,234,1,-1628,18,-19,-1856,13,559,95,1499,323,1000,597,4508,9237,4309,4928,94,10120,1476,8644,57,11249,1191,10058,468,1543,1708,2732,237,193]
[10,"Alavus",11544,null,0.3384476903563684,59.982757781593932,-5336.5384615384619,null,null,null,38.205106750895979,1512.6472626472628,37.079702135086393,14889.98613998614,null,71741,137803,1547,-64515,33798,38294,null,null,-519,610,7668,6649,0,null,1019,-4,9,-17,-68,939,20657,6355,null,1916,-23837,-2613,null,null,null,null,21.25,null,86,11468,null,0.98395149786019975,65.261180938228804,-5163.2368329264036,null,null,null,38.499838262623442,1616.7596791070807,39.883901559045157,13921.259155912103,null,72735,141054,562,-67757,34552,38072,null,null,-502,584,4949,7456,9142,null,6635,17,11,14,-71,6578,25846,4316,null,-8385,-5039,1385,null,null,null,null,21.25,null,153,11332,null,1.7959693537641572,65.19184533807595,-5382.3685139428171,null,null,null,38.556864660277149,2590.0105894811154,66.778142785012122,14156.636074832333,null,73727,142464,488,-68249,34963,43125,null,null,-534,906,10211,8085,0,null,2126,-5,29,21,-64,2065,28359,9415,null,10985,-5432,-1708,null,null,null,null,21.25,null,191,null,null,null,null,null,null,-9478,139,371,-13156,466,9759,-12011,591,297,25419,-996,9250,3039,11822,-4269,71092,64304,6788,2698,78561,67864,10697,1957,80862,73460,7402,10985,1995,1494,1299,1932,2372]
[16,"Asikkala",8149,null,6.1349999999999998,38.468645982923107,-2786.845011657872,null,null,null,47.373709017301756,941.58792489876055,31.678637679847974,10848.938520063812,null,43453,84756,-6,-41309,28838,17538,null,null,-109,-163,4795,4165,263,null,893,0,0,-13,-59,821,10527,4897,null,1261,-687,2672,null,null,null,null,20.75,null,118,8083,null,3.4315286624203822,34.112320399208464,-2855.3754794012125,null,null,null,49.385642789631078,490.28825930966224,29.704665740377376,11664.357293084251,null,42608,88825,16,-46201,29745,20631,null,null,-93,124,4206,4111,-266,null,-171,-2,0,3,-28,-204,10323,3682,null,-503,-1152,-215,null,null,null,null,20.75,null,115,8059,null,13.188106796116505,26.382677324698978,-2044.2983000372258,null,null,null,58.082631367829926,693.01402159076804,21.775623564599691,11616.205484551432,null,42719,87980,7,-45254,31842,24269,null,null,-130,1,10728,4146,0,null,6582,-2,0,1,-57,6522,16120,10566,null,822,-685,6435,null,null,null,null,20.75,null,46,null,null,null,null,null,null,-2610,106,279,-3980,3,80,-4516,25,360,82,-1150,12,-2530,0,-5668,23108,8822,14286,344,19437,7683,11754,350,13084,7002,6082,822,12,11,0,16410,13868]
[18,"Askola",4958,null,0.55878712871287128,80.769047278278705,-5369.9072206534893,null,null,null,16.294861424496574,1060.9116579265833,40.30355193551096,9607.9064138765625,null,14418,41260,-2,-26844,18547,8957,null,null,-216,243,687,2089,2228,null,826,0,178,-6,0,998,-1633,2718,null,201,-1400,-1523,null,null,null,null,20.75,null,265,4943,null,1.7619047619047619,84.320400974064356,-5149.0997370018213,null,null,null,21.089637758570458,1390.4511430305481,41.543688059895267,9349.3829658102368,null,14287,39474,3,-25184,19707,8303,null,null,-274,281,2833,2340,2496,null,2989,-2,7,1,0,2993,1595,5184,null,-1599,-1489,835,null,null,null,null,21.5,null,100,4878,null,2.681174089068826,79.464790501915942,-5142.886428864289,null,null,null,28.019906499773789,2148.4214842148422,77.656421291972876,10097.990979909799,null,17350,42794,-1,-25445,20456,9951,null,null,-219,330,5073,2989,0,null,2084,-1,6,11,0,2078,3673,5034,null,1301,-1751,865,null,null,null,null,21.5,null,117,null,null,null,null,null,null,-4701,21,439,-4914,308,257,-4429,132,128,7045,-1916,5527,-1757,726,3270,28168,21682,6486,0,29815,25380,4435,0,32665,24845,7820,1301,2000,2000,2000,345,1267]
[19,"Aura",3984,null,1.2023622047244094,56.550585501574588,-3912.9016064257025,null,null,null,25.069680424573328,261.29518072289153,10.90787736119883,8743.4738955823304,null,12003,31204,1,-19200,14314,6390,null,null,-52,23,1475,1297,0,null,178,-41,-81,0,-21,35,1642,1562,null,-278,-1218,-850,null,null,null,null,21.75,null,189,3941,null,1.3693239152371341,58.695847698995649,-3963.9685359045925,null,null,null,25.486531061022539,507.99289520426282,11.029462989840347,8741.4361837097185,null,12253,32020,7,-19760,14707,6395,null,null,-50,15,1307,1309,-1,null,-3,-46,-107,0,-26,-182,1610,1331,null,-87,-941,121,null,null,null,null,21.75,null,197,3959,null,2.2308132875143185,52.070246353853719,-3303.3594342005558,null,null,null,31.96777277072238,1051.2755746400605,42.307349541872057,9069.7145743874717,null,12469,32750,9,-20272,15595,8550,null,null,-63,21,3831,1367,0,null,2464,-32,-66,0,-15,2351,3988,3888,null,129,-1682,2393,null,null,null,null,21.5,null,141,null,null,null,null,null,null,-2336,16,-92,-1414,26,178,-1397,20,-118,225,464,5095,-2855,132,592,14251,3750,10501,0,15560,7404,8156,0,14602,6082,8520,129,1020,657,773,1286,1570]
[46,"Enonkoski",1405,null,7.7179487179487181,18.698988319241483,748.75444839857653,null,null,null,74.059745037102815,2365.8362989323846,57.851420942208662,14926.690391459075,null,10151,19928,0,-9777,4481,5829,null,null,-7,62,588,843,5,null,-250,0,1,-1,-8,-258,6659,577,null,469,-64,-225,null,null,null,null,21,null,174,1361,null,15.931506849315069,15.756728079482976,1111.6825863335782,null,null,null,77.53552657192914,2612.0499632623073,59.331018631717932,15024.981631153563,null,10276,19669,0,-9393,4713,5745,null,null,-6,94,1153,877,0,null,276,0,0,0,-4,272,6931,1104,null,328,-63,438,null,null,null,null,21,null,33,1369,null,191.8,17.468672846694925,1962.7465303140978,null,null,null,75.682094653304759,3822.4981738495253,93.382467976923834,14940.832724616508,null,10495,19664,0,-9169,4642,6330,null,null,-9,115,1909,792,6,null,1123,0,0,0,3,1126,8046,1830,null,22,-1,1194,null,null,null,null,21,null,36,null,null,null,null,null,null,-907,94,11,-702,12,24,-771,1,134,9,52,16,-231,387,-63,1082,787,295,0,804,648,156,0,1129,880,249,22,108,108,108,449,415]
[47,"Enontekiö",1852,null,1.4804177545691906,65.110792821636196,-6109.6112311015122,null,null,null,38.778688220681474,1225.7019438444925,33.211079044412379,13470.842332613391,null,8772,22485,-11,-13724,6362,8604,null,null,-121,443,1564,1111,0,null,453,0,10,-23,-1,439,1933,1596,null,723,-1012,852,null,null,null,null,21.25,null,41,1838,null,1.1656746031746033,64.784320365745245,-6209.4668117519041,null,null,null,39.994780209537304,1076.1697497279652,31.210682939691871,14443.416757344939,null,8571,22860,-7,-14296,6263,8789,null,null,-77,401,1080,1024,0,null,56,0,1,30,-4,23,2110,1087,null,231,-913,-584,null,null,null,null,21.25,null,91,1808,null,1.993677555321391,66.668021459925214,-6824.1150442477874,null,null,null,39.889924980719343,1245.0221238938052,30.227548655310699,15033.738938053099,null,8457,22984,-10,-14537,6394,9753,null,null,-50,271,1831,1189,-1,null,641,0,0,-11,5,657,2797,1670,null,503,-888,-994,null,null,null,null,21.25,null,128,null,null,null,null,null,null,-1018,87,187,-2409,492,246,-2941,132,145,0,48,261,787,499,1440,9399,7721,1678,136,9071,6633,2438,35,10084,6210,3874,503,1161,324,312,323,290]
[49,"Espoo",283632,null,1.7712961263080595,143.48878060487368,-9498.6849156653698,null,null,null,40.414220850683257,3541.0320415185874,118.50017277812024,10906.960427596323,null,1102801,2383893,-1616,-1282708,1501986,95314,null,null,-35590,20923,299925,306013,0,null,-6088,3973,12237,-622,2802,12302,604643,229225,null,-1956,-148680,-151086,null,null,null,null,18,null,19,289731,null,1.632158999442759,149.83547467507452,-10314.115507142831,null,null,null,38.123464684348875,3381.260548577819,107.7189557905575,11746.0230351602,null,1171298,2544378,-1283,-1374363,1521184,113469,null,null,-34689,44470,270071,323458,0,null,-53387,3766,15025,603,2899,-32300,551120,183927,null,-59706,-147551,-324600,null,null,null,null,18,null,25,292796,null,2.1386206623251391,155.5888243504856,-10999.419390975287,null,null,null,36.185730725953562,4266.0794546373581,125.76346462157716,12381.33034604298,null,1178888,2601118,1586,-1420644,1605340,267013,null,null,-39454,22485,434740,330694,0,null,104046,4334,15019,837,618,123180,665687,354934,null,-40753,-176149,-253438,null,null,null,null,18,null,25,null,null,null,null,null,null,-495489,36891,78287,-661148,58030,94591,-784640,84956,91312,219699,1933,449241,-1583,666902,-4877,3502631,3329807,172824,208048,3802739,3607234,195505,205140,4285902,4076880,209022,-40753,92306,94817,96757,602654,845683]
[50,"Eura",11748,null,0.47165354330708659,70.15753209251794,-5271.7909431392573,null,null,null,31.1763410067188,486.38066053796393,18.378980947848923,9659.346271705821,null,36008,103147,0,-67139,43565,25358,null,null,-377,9,1416,5804,0,null,-4388,36,0,0,38,-4314,1114,1138,null,877,-3429,-4519,null,null,null,null,20.5,null,272,11632,null,0.55009052504526257,76.194462209849135,-6003.610729023384,null,null,null,26.790557778553588,429.16093535075657,17.723927527364197,10116.231086657497,null,36328,104526,0,-68198,43287,26709,null,null,-340,22,1480,6065,3,null,-4582,10,0,2,26,-4548,-3389,1283,null,-216,-2971,-8008,null,null,null,null,20.5,null,253,11483,null,3.2378612716763007,68.361912411818125,-5715.5795523817824,null,null,null,30.047857894783402,538.09979970391009,19.764742483064438,9937.2115300879559,null,37130,103474,0,-66344,45835,31571,null,null,-409,137,10790,6675,0,null,4115,16,0,2,-20,4109,683,10771,null,-302,-3047,4338,null,null,null,null,21,null,159,null,null,null,null,null,null,-6341,81,603,-9684,41,352,-7143,47,663,933,4000,5648,6000,544,-188,54266,33394,20872,50,63193,36129,27064,50,60326,33148,27178,-302,607,424,854,1865,1887]
[51,"Eurajoki",9454,null,2.9886304909560724,33.19823769702932,15.337423312883436,null,null,null,75.003105493618207,2765.1787603130947,99.312336722905101,10162.78823778295,null,31437,87039,0,-55602,50340,11737,null,null,-129,-693,5653,5919,0,null,-266,1,-52,0,-7,-324,75926,5702,null,1108,-1805,1863,null,null,null,null,18,null,113,9402,null,2.7975016436554898,30.76287235934835,-38.608806636885767,null,null,null,75.731238509109147,2591.6826207189956,95.438342051830887,10633.801318868325,null,32393,93103,0,-60710,52060,11120,null,null,-49,1785,4206,5684,0,null,-1478,0,-49,13,-14,-1554,74437,4127,null,385,-1472,-654,null,null,null,null,18,null,143,9452,null,2.5040526849037485,32.856197937121479,19.043588658484975,null,null,null,74.352081122509134,2637.0080406263223,88.212550783939179,10911.235717308506,null,31423,92433,0,-61010,51185,14150,null,null,-128,616,4813,5453,86,null,-554,0,-24,1,-6,-585,73724,4709,null,-2393,-1844,382,null,null,null,null,18,null,281,null,null,null,null,null,null,-5328,16,1473,-4977,48,148,-8421,24,4070,660,-379,402,-448,3413,130,16111,14279,1832,62,14768,12838,1930,105,16034,14051,1983,-2393,47,0,335,201,1217]
[52,"Evijärvi",2473,null,-0.42926829268292682,42.641199424933248,-877.88111605337645,null,null,null,49.380515197432928,2844.3186413263243,97.553385515616696,10642.135058633239,null,7570,24216,4,-16642,7975,8800,null,null,21,-270,-116,940,0,null,-1056,-2,-25,-2,-1,-1086,2289,-188,null,41,-177,-1554,null,null,null,null,21.5,null,286,2425,null,2.4423076923076925,52.372211803200194,-1726.1855670103093,null,null,null,43.984696635754979,3125.7731958762888,92.290426676228037,11501.030927835052,null,7743,25616,1,-17872,8046,9272,null,null,24,624,94,1115,0,null,-1021,4,-12,2,2,-1029,1214,79,null,-100,-19,-1866,null,null,null,null,21.5,null,271,2408,null,2.8091168091168091,58.585431481837404,-2340.9468438538206,null,null,null,39.840652934317916,3496.262458471761,107.88663413264052,11828.488372093023,null,7707,25330,2,-17621,8100,10208,null,null,35,231,953,1260,0,null,-307,-1,-5,5,0,-318,887,886,null,255,-318,-1345,null,null,null,null,21.5,null,288,null,null,null,null,null,null,-1537,75,96,-2124,160,19,-2299,61,7,538,550,299,1000,699,3209,8210,2398,5812,54,9505,2530,6975,52,13108,3063,10045,255,11,4,0,357,1072]
{"$rows_left_out":282}