{"text_format":"1","workbook":"xlsx","n_sheets":2,"sheets":["Kuntakortti","Luvut"],"not_rendered":{"charts":0,"images":0,"macros":1,"external_links":0,"defined_names":2,"comments":0,"pivot_tables":0},"unopened":[],"bounds":{"document_bytes":16777216,"sheet_cells":100000,"rows_first":2000,"rows_last":500,"rows_between":2000,"halvings":0,"cell_chars":16384,"cell_head_chars":4096},"cells_cut":0,"cells_raw":0,"read":"whole","date_system":"1900"}

{"sheet":"Kuntakortti","index":0,"n_rows":79,"n_cols":20,"rows_kept":79,"cut":false,"hidden":false,"merged":[[1,6,1,7]]}
["Valtiovarainministeriö/Kunta- ja aluehallinto-osasto, 1.6.2021"]
["KUNTIEN LOPULLISET TP:T 2018-2019 ja TPennakko 2020 ",null,null,null,null,null,"Valitse kunta valikosta:"]
[null,null,null,null,null,null,null," "]
[{"$f":"INDEX(Luvut!$B$3:'Luvut'!$B$297,$A$7)","v":"KOKO MAA (Manner-Suomi)"},null,null,2018,null,null,2019,null,null,2020]
[]
["Asukasluku",null,null,{"$f":"VLOOKUP($A$4,Luvut!$B$3:$AT$297,2)","v":5488130},null,null,{"$f":"VLOOKUP($A$4,Luvut!$B$3:$ED$297,46)","v":5495408}," ",{"$f":"((G6/D6)-1)*100","v":0.13261347672157697},{"$f":"VLOOKUP($A$4,Luvut!$B$3:$ED$297,90)","v":5503664}," ",{"$f":"((J6/G6)-1)*100","v":0.15023452307818541},null,null,null,null,"Kunta"]
[96,null,null," ",null,null,null,null,null,null,null,null,null,null,null,null,null,2018,2019,2020]
["Tunnuslukuja",null,null," ",null,null,null,null,null,null,null,null,null,null,null,null,"Vuosikate",{"$f":"D36","v":2065203},{"$f":"G36","v":1747616},{"$f":"J36","v":4072987}]
[null,null,null," "," "," "," ",null,"muutos%"," ",null,"muutos%",null,"Konsernivelka, €","Konsernivelka, €","Konsernivelka, €","Poistot",{"$f":"D38","v":2192453},{"$f":"G38","v":2305725},{"$f":"J38","v":2397525}]
["Lainat, euro/as",null,null,{"$f":"E67","v":3048.3937151634527}," ",null,{"$f":"H67","v":3351.8961649435309},null,{"$f":"((G10/D10)-1)*100","v":9.9561434033400342},{"$f":"K67","v":3458.3115902424274},null,{"$f":"((J10/G10)-1)*100","v":3.1747828710168013},null,2018,2019,2020,"Tilikauden tulos",{"$f":"D41","v":-107421},{"$f":"G41","v":-164092},{"$f":"J41","v":1756706}]
["Konsernilainat, euro/as",null,null,{"$f":"VLOOKUP($A$4,Luvut!$B$3:$FM$297,167)","v":6557.6436782656392},null,null,{"$f":"VLOOKUP($A$4,Luvut!$B$3:$FM$297,168)","v":7105.3242998518035},null,{"$f":"((G11/D11)-1)*100","v":8.3517898875989935},{"$f":"VLOOKUP($A$4,Luvut!$B$3:$FN$297,169)","v":7480.9228906415792},null,{"$f":"((J11/G11)-1)*100","v":5.2861569006443565},null,{"$f":"D11*D6","v":35989201000},{"$f":"G11*G6","v":39046656000},{"$f":"J11*J6","v":41172486000},"Taseen kertynyt ali-/ylijäämä",{"$f":"D47","v":11261407},{"$f":"G47","v":11087957},{"$f":"J47","v":12581318}]
["Lainanhoitokate",null,null,{"$f":"VLOOKUP($A$4,Luvut!$B$3:$AT$297,4)","v":1.1218667063571479}," ",null,{"$f":"VLOOKUP($A$4,Luvut!$B$3:$ED$297,48)","v":0.7093755419490988},null,null,{"$f":"VLOOKUP($A$4,Luvut!$B$3:$ED$297,92)","v":1.9886386140704735},null,null,null,null,null,null,"Toiminnan ja investointien rahavirta",{"$f":"D60","v":-1214884},{"$f":"G60","v":-1434149},{"$f":"J60","v":381794}]
["Suhteellinen velkaantuneisuus, %",null,null,{"$f":"VLOOKUP($A$4,Luvut!$B$3:$AT$297,5)","v":58.68132053012561}," ",null,{"$f":"VLOOKUP($A$4,Luvut!$B$3:$ED$297,49)","v":62.067154779893912},null,null,{"$f":"VLOOKUP($A$4,Luvut!$B$3:$ED$297,93)","v":59.956439650633136},null,null,null,null,null,null,"Lainakanta",{"$f":"D67","v":16729981},{"$f":"G67","v":18420037},{"$f":"J67","v":19033385}]
["Rahoitusvarallisuus, euro/as",null,null,{"$f":"VLOOKUP($A$4,Luvut!$B$3:$AT$297,6)","v":-2782.6265048386244}," ",null,{"$f":"VLOOKUP($A$4,Luvut!$B$3:$ED$297,50)","v":-3029.5543115270057},null,null,{"$f":"VLOOKUP($A$4,Luvut!$B$3:$ED$297,94)","v":-2940.7692766128166},null,null,null,null,null,null,"Lainanhoitokate",{"$f":"D12","v":1.1218667063571479},{"$f":"G12","v":0.7093755419490988},{"$f":"J12","v":1.9886386140704735}]
["Omavaraisuusaste, %",null,null,{"$f":"VLOOKUP($A$4,Luvut!$B$3:$AT$297,10)","v":59.513878587260145},null,null,{"$f":"VLOOKUP($A$4,Luvut!$B$3:$ED$297,54)","v":57.827627708032679},null,null,{"$f":"VLOOKUP($A$4,Luvut!$B$3:$ED$297,98)","v":57.958734458090227},null,null,null,null,null,null,"Veroprosentti",{"$f":"D72","v":19.87},{"$f":"G72","v":19.899999999999999},{"$f":"J72","v":19.98}]
{"$rows_left_out":65}
{"sheet":"Luvut","index":1,"n_rows":297,"n_cols":179,"rows_kept":297,"cut":false,"hidden":false,"merged":[]}
[null,null,2018,null,92,93,94,95,96,97,98,99,100,101,102,103,104,105,106,107,108,null,110,111,112,113,114,115,116,117,118,119,120,121,122,null,124,125,126,127,128,129,130,131,132,133,2019,null,92,93,94,95,96,97,98,99,100,101,102,103,104,105,106,107,108,109,110,111,112,113,114,115,116,117,118,119,120,121,122,123,124,125,126,127,128,129,130,131,132,133,2020,null,92,93,94,95,96,97,98,99,100,101,102,103,104,105,106,107,108,"summana",110,111,112,113,114,115,116,117,118,119,120,121,122,123,124,125,126,127,128,129,130,131,132,133,"Erillistiedot",135,136,137,138,139,2018,144,145,2019,147,148,2020,147,148,2018,152,2019,154,2020,null,2018,160,161,162,2019,164,165,166,2020,164,165,166,2018,2019,2020,"Yhden vero%:n","Yhden vero%:n"]
["Kunta nro","Kunta","Asukasluku ",null,"Lainanhoitokate","Suhteellinen velkaantuneisuus-%","Rahoitusvarallisuus, e/as",null,null,null,"Omavaraisuusaste, %","Rahavarat e/as","Kassan riittävyys, pv","Kassasta maksut, €/as","Henkilöstökulut","Toimintatuotot","Toimintakulut","Toimintakate","Verotulot","Valtionosuudet","Alv-takaisinperintä",null,"Korkotuotot/-menot, netto","Muut rahoitustuotot/-menot, netto (sis Osinkotuotot)","Vuosikate","Suunnitelman mukaiset poistot ja arvonalet","Satunnaiset tuotot","Satunnaiset kulut","Tilikauden tulos","Poistoeron lisäys(-) tai vähennys(+)","Varausten lisäys(-) tai vähennys(+)","Rahastojen lisäys(-) tai vähennys(+)","Tilikauden yli- tai alijäämä","Kumulat yli/alij","Tulorah (toiminnan rahavirta)",null,"Saamisten muutos ","Pitkäaikaisten lainojen vähennys","Toim ja inv rahavirta","Verotulot","Kunnallisvero","Osuus yhteisöveron tuotosta","Kiinteistövero","Tuloveroprosentti",null,"Sijoitus vuosikatteen mukaan","Asukasluku ",null,"Lainanhoitokate","Suht. velkaantuneisuus-%","Rahoitusvarallisuus, e/as",null,null,null,"Omavaraisuusaste, %","Rahavarat e/as","Kassan riittävyys, pv","Kassasta maksut, €/as","Henkilöstökulut","Toimintatuotot","Toimintakulut","Toimintakate","Verotulot","Valtionosuudet",null,null,"Korkotuotot/-menot, netto","Muut rahoitustuotot/-menot, netto (sis Osinkotuotot)","Vuosikate","Suunnitelman mukaiset poistot ja arvonalet","Satu. tuotot","Satu. kulut","Tilikauden tulos","Poistoeron lisäys(-) tai vähennys(+)","Varausten lisäys(-) tai vähennys(+)","Rahastojen lisäys(-) tai vähennys(+)","Tilikauden yli- tai alijäämä","Kumulat yli/alij","Tulorah (toiminnan rahavirta)",null,"Saamisten muutos ","Pitkäaikaisten lainojen vähennys","Toim ja inv rahavirta","Verotulot","Kunnallisvero","Osuus yhteisöveron tuotosta","Kiinteistövero","Tuloveroprosentti ",null,"Sijoitus vuosikatteen mukaan","Asukasluku",null,"Lainanhoitokate","Suht. velkaantuneisuus-%","Rahoitusvarallisuus, e/as",null,null,null,"Omavaraisuusaste, %","Rahavarat e/as","Kassan riittävyys, pv","Kassasta maksut, €/as","Henkilöstökulut","Toimintatuotot","Toimintakulut","Toimintakate","Verotulot","Valtionosuudet","Alv-takaisinperintä","Käyttökate","Korkotuotot/-menot, netto","Muut rahoitustuotot/-menot, netto (sis Osinkotuotot)","Vuosikate","Suunnitelman mukaiset poistot ja arvonalet","Satu. tuotot","Satu. kulut","Tilikauden tulos","Poistoeron lisäys(-) tai vähennys(+)","Varausten lisäys(-) tai vähennys(+)","Rahastojen lisäys(-) tai vähennys(+)","Tilikauden yli- tai alijäämä","Kumulat yli/alij","Toiminnan rahavirta",null,"Saamisten muutos ","Pitkäaikaisten lainojen vähennys","Toim ja inv rahavirta","Verotulot","Kunnallisvero","Osuus yhteisöveron tuotosta","Kiinteistövero","Tuloveroprosentti ",null,"Sijoitus vuosikatteen mukaan","Palvelujen ostot 2018","Palvelujen ostot 2019","Palvelujen ostot 2020","Harkvar2018","Harkvar2019","Harkvar2020"," - Investointimenot"," + Rahoitusos. investointimenoihin"," + Investointihyödykk. luovutustulot"," - Investointimenot"," + Rahoitusosuudet investointimenoihin"," + Investointihyödykkeiden luovutustulot"," - Investointimenot"," + Rahoitusosuudet investointimenoihin"," + Investointihyödykkeiden luovutustulot","Pitkäaikaisten lainojen lisäys"," ± Lyhytaikaisten lainojen muutos","Pitkäaikaisten lainojen lisäys"," ± Lyhytaikaisten lainojen muutos","Pitkäaikaisten lainojen lisäys"," ± Lyhytaikaisten lainojen muutos","Lainakanta","josta pitkäaik","josta lyhytaik","Lainasaamiset","Lainakanta","josta pitkäaik","josta lyhytaik","Lainasaamiset","Lainakanta","josta pitkäaik","josta lyhytaik","Lainasaamiset","Konsernilainat €/as","Konsernilainat €/as","Konsernilainat €/as","tuotto","tuotto, €/as"]
[20,"Akaa",16611,null,0.40412044374009509,62.298129324180955,-3676.9008488351092,null,null,null,25.829980420423006,248.63042562157605,12.614538790470373,7194.0882547709352,44053,20752,108994,-88242,59625,29905,null,null,62,878,2228,4577,0,0,-2349,27,0,0,-2322,-8886,1932,null,398,-5988,-1357,59625,54693,1613,3319,21.75,null,206,16475,null,0.80323175774540367,59.075532601678503,-3668.7101669195749,null,null,null,25.899652860130661,178.69499241274659,8.8358974780656681,7381.6691957511384,44817,21733,110542,-88791,62993,31449,null,null,85,321,6057,6043,0,0,14,26,0,0,40,-8846,5908,null,-1750,-5507,778,62993,57840,1596,3557,22.25,null,66,16391,null,3.2927056196501674,54.56404061055224,-3487.7066682935756,null,null,null,33.645378594008733,528.5827588310658,23.687735015205764,8144.8355805014944,44739,28305,112143,-83838,64150,36698,null,null,99,378,17487,5748,0,0,11739,20,0,0,11759,2911,12838,null,620,-5166,3234,64150,59104,1773,3273,22.25,null,22.794117647058901,50584,49394,50719,null,1000,null,-3773,130,354,-5323,34,159,-16001,115,6282,7500,-56,0,5020,12000,-8000,54097,38470,15627,7639,53609,33398,20211,7639,52444,40805,11639,7647,4285.7142857142853,4463.186646433991,4623.2078579708377,{"$f":"(DY3/EB3)","v":2656.3595505617977},{"$f":"(FO3/CM3)*1000","v":162.06207983416496},null,null,null,null,null,4670,{"$f":"FV3*-1","v":-4670}]
[5,"Alajärvi",9700,null,0.76709401709401714,39.342238065582926,-2770.9278350515465,null,null,null,47.735358222597199,405.56701030927832,14.024476002578478,10555.257731958764,41606,29186,90428,-61242,28893,35055,null,null,-193,147,2660,3573,0,0,-913,0,0,0,-913,7731,2602,null,911,-3532,-4891,28893,24613,2142,2138,21.75,null,123,9562,null,0.34200108228190595,38.199113867153457,-3405.7728508680193,null,null,null,43.140005395198273,352.54130934950842,10.292828401970873,12501.673290106672,45948,44709,107678,-62969,29512,34792,null,null,-202,150,1283,3246,0,0,-1963,0,0,0,-1963,5768,1301,null,125,-3838,-5586,29512,25292,2066,2154,21.75,null,162,9419,null,1.3470940959409594,37.566943096129393,-3337.7216264996282,null,null,null,44.059835142794292,478.6070708143115,14.18013219921232,12319.460664614078,45160,43439,106079,-62640,29583,38640,null,null,-186,252,5649,3584,0,0,2065,0,0,0,2065,7833,5646,null,-298,-4144,322,29583,25512,2144,1927,21.75,null,184.97794117647001,38046,49572,48993,null,null,null,-8209,576,140,-7703,779,37,-5620,275,21,4000,2000,8070,0,4000,0,23626,15945,7681,451,27858,19714,8144,543,27715,19420,8295,536,4713.5051546391751,5270.5500941225682,5437.3075698057119,1172.9655172413793,124.53185234540602,null,null,null,null,null,3040,-3040]
[9,"Alavieska",2573,null,2.1957773512476009,57.307815674115254,-3238.6319471434126,null,null,null,41.54699738903394,672.75553828216096,33.43998094633217,7343.1791682860503,4254,2153,17572,-15419,7528,9025,null,null,-28,10,1116,719,0,0,397,0,0,0,397,107,1028,null,605,-493,553,7528,6537,259,732,21.5,null,63,2519,null,1.1490431084477093,56.665442526625043,-3183.0091306073837,null,null,null,43.548975655528331,720.12703453751487,34.645492124954217,7586.7407701468837,4470,2190,17586,-15396,7962,8909,null,null,-26,11,1460,745,0,0,715,0,0,0,715,823,1460,null,-313,-344,324,7962,6931,263,768,22,null,17,2517,null,0.49544072948328266,56.152367811560637,-2744.1398490266188,null,null,null,45.631758679567447,1490.2661899086213,56.911294010059443,9557.8069129916566,4572,2476,18348,-15872,7716,10101,null,null,15,11,1971,705,0,0,1266,0,0,0,1266,2090,1843,null,233,-3963,1594,7716,6711,305,700,22,null,96.330882352941202,11724,11440,12132,null,null,null,-796,144,177,-1151,0,15,-1061,11,801,0,1500,0,1000,0,4500,8807,3963,4844,84,9463,833,8630,84,10000,0,10000,774,3589.9727944034203,4017.4672489082964,4469.209376241557,305.04545454545456,121.19406219525409,null,null,null,null,null,792,-792]
[10,"Alavus",11544,null,0.13954724671067203,55.822813533816628,-2585.4989604989605,null,null,null,50.604927178887102,1225.8316008316008,46.872924115650576,9545.5647955647946,23328,11762,82024,-70262,33901,38294,null,null,-32,999,2900,3286,0,0,-386,0,0,0,-386,14779,2686,null,694,-22323,-2411,33901,28747,2398,2756,21.25,null,138,11468,null,0.2171916408731363,63.285908259047169,-2337.2863620509243,null,null,null,50.387057174528429,1263.1670735960934,54.930497839095743,8393.442622950819,24125,11960,84410,-72208,34663,38072,null,null,-71,620,1076,3653,9142,0,6565,0,0,0,6565,21344,886,null,-9544,-3177,1926,34663,29279,2585,2799,21.25,null,183,11332,null,1.2806647940074907,63.145369428957686,-2458.6127779738795,null,null,null,49.576604180095543,2285.9159901164844,98.138525891865527,8501.8531591951996,23589,11612,85363,-73751,35072,43125,null,null,-106,837,5177,4032,0,0,1145,0,0,0,1145,22489,5031,null,9535,-3978,-1397,35072,29760,2810,2502,21.25,null,240.38235294117601,51990,53095,54746,null,null,null,-5594,131,366,-8782,156,9666,-6980,262,290,23000,-1000,8000,2000,7400,-3000,38419,34242,4177,8286,45243,38265,6978,7374,45665,41500,4165,7195,6158.3506583506578,6850.4534356470176,7135.7218496293681,1400.4705882352941,123.58547372355225,null,null,null,null,null,2706,-2706]
[16,"Asikkala",8149,null,48.338709677419352,27.159977173292752,-1227.2671493434777,null,null,null,72.149432751441992,359.30789053871644,20.990277914170676,6248.0058902932869,13175,6194,49448,-43254,28838,17538,null,null,-41,-126,2955,2255,0,0,700,94,0,0,794,10946,2847,null,765,-20,1928,28838,24509,1436,2893,20.75,null,90,8083,null,2.1669106881405562,21.974680745204267,-1233.9477916615119,null,null,null,75.357891584306685,123.22157614746999,6.7047822799284411,6708.0291970802919,13729,6112,52010,-45898,29745,18410,null,null,-40,147,2364,2215,0,182,-33,94,0,0,61,11007,2079,null,396,-15,145,29745,25296,1538,2911,20.75,null,90,8059,null,160.92592592592592,10.143804937190584,-381.06464821938204,null,null,null,87.028956763189214,110.80779253009058,6.1119653471844586,6617.3222484179178,13872,5611,50709,-45098,31883,21892,null,null,-44,13,8646,2509,0,0,6137,94,-5000,0,1231,12238,8594,null,-1107,-10,6563,31883,27480,1731,2672,20.75,null,21.786764705882401,32499,34689,33295,null,null,null,-1179,95,165,-2006,0,72,-2276,19,226,0,-1500,0,-3000,0,-5500,10470,1455,9015,810,7455,1445,6010,810,1945,1435,510,791,2835.6853601668918,2404.6764815043916,1623.5264921206106,1324.3373493975903,164.33023320481331,null,null,null,null,null,380,-380]
[18,"Askola",4958,null,-1.3781223083548665E-2,81.339901477832512,-3928.8019362646228,null,null,null,22.155937127146341,793.66680112948768,42.155352058935748,6871.9241629689386,13618,4412,30745,-26333,18547,7491,null,null,-182,279,-198,1255,2228,0,775,0,0,0,775,-699,1965,null,125,-979,189,18547,16454,949,1144,20.75,null,264,4943,null,0.73018462222881297,84.090208885328735,-3763.3016386809632,null,null,null,27.030898301616535,1226.1784341493021,61.518450543644505,7275.1365567469147,13781,4448,30316,-25868,19707,8303,null,null,-231,319,2230,1274,2496,0,3452,0,0,0,3452,2648,4638,null,-1278,-1238,1046,19707,17550,957,1200,21.5,null,43,4878,null,2.606299212598425,81.299611796743733,-3670.5617056170563,null,null,null,33.043519687477669,1757.8925789257892,87.3291015625,7347.273472734727,13415,4111,30586,-26475,20456,9951,null,null,-173,366,4125,2141,0,0,1984,0,0,0,1984,4631,4098,null,1047,-1473,694,20456,18369,1008,1079,21.5,null,72.154411764705898,13333,12858,13433,null,680,null,-2145,13,356,-4153,308,253,-3582,114,64,5000,-2243,5000,-2000,0,3500,21209,15576,5633,0,22972,18999,3973,0,24997,17473,7524,0,5681.3231141589349,6031.7620878009302,6696.3919639196392,854.37209302325584,175.14803055007295,null,null,null,null,null,699,-699]
[19,"Aura",3984,null,1.1440329218106995,60.236665796571828,-3204.5682730923695,null,null,null,27.083119284907017,26.857429718875501,1.5820067241868192,6196.5361445783128,6172,2672,22180,-19508,14314,6000,null,null,-15,28,819,804,0,0,15,28,0,0,43,179,643,null,-215,-714,-977,14314,12992,571,751,21.75,null,163,3941,null,0.35407786302926969,64.10344237026888,-3314.6409540725704,null,null,null,24.504793887185478,248.92159350418675,14.539529784382994,6248.9215935041866,6514,2647,22749,-20102,14707,6002,null,null,-13,16,610,847,0,0,-237,28,0,0,-209,-30,747,null,44,-714,-317,14707,13353,603,751,21.75,null,153,3959,null,2.5459677419354838,55.662202663226978,-2722.9098257135638,null,null,null,32.438339057133938,799.94948219247283,45.569243505341582,6407.4261177064918,6688,2657,23226,-20569,15595,8107,null,null,-26,24,3131,893,0,0,2238,28,0,0,2266,2236,2883,null,203,-1214,2177,15595,14340,541,714,21.5,null,91.294117647058897,12947,12935,13287,null,null,540,-1759,0,139,-1132,22,46,-888,1,181,0,200,5000,-2700,0,500,11462,1548,9914,0,13047,5333,7714,0,12333,4357,7976,0,3577.0582329317267,3948.2364882009642,3688.3051275574639,666.97674418604652,168.47101393939036,null,null,null,null,null,607,-607]
[46,"Enonkoski",1405,null,{"$error":"#DIV/0!"},13.286775897573641,1288.9679715302491,null,null,null,87.912354463130654,1987.9003558718862,86.864775051124738,8353.0249110320274,2372,1385,10931,-9546,4481,5335,null,null,17,52,339,595,0,0,-256,0,0,1,-255,5864,339,null,147,0,-357,4481,3379,569,533,21,null,143,1361,null,7.6088474970896387,10.682596854959149,1544.4526083761939,null,null,null,89.985320502365028,2108.0088170462896,93.265496971856081,8249.8163115356347,2446,1423,10689,-9244,4713,5247,null,null,12,89,817,655,0,0,162,0,0,0,162,6025,817,null,54,0,267,4713,3580,597,536,21,null,15,1369,null,{"$error":"#DIV/0!"},11.057046979865772,2508.4002921840761,null,null,null,88.432256633897552,3284.8794740686631,151.81326304106548,7897.7355734112489,2445,1564,10567,-9003,4642,5745,null,null,8,110,1502,573,0,0,929,0,0,0,929,6955,1433,null,-279,0,1288,4642,3472,680,490,21,null,17.757352941176499,7560,7318,7242,null,null,null,-780,80,4,-558,0,8,-275,0,130,0,0,0,0,0,0,0,0,0,286,0,0,0,261,0,0,0,236,770.10676156583634,590.74210139603235,824.68955441928415,165.33333333333334,120.76941806671537,null,null,null,null,null,63,-63]
[47,"Enontekiö",1852,null,0.88922610015174508,34.843029143693037,-2738.1209503239743,null,null,null,54.992215528328707,183.04535637149027,6.4789506754634001,10312.095032397408,7223,2808,17628,-14820,6362,8604,null,null,-5,394,535,354,0,0,181,0,0,0,181,1446,487,null,174,-608,171,6362,5155,384,823,21.25,null,115,1838,null,0.60100398130517574,37.611123774789149,-3074.5375408052232,null,null,null,53.899776404051032,26.659412404787812,0.89304439007340086,10896.082698585418,6826,2496,17495,-14999,6263,8789,null,null,-32,376,397,366,0,0,31,-40,41,0,32,1478,323,null,-116,-600,-615,6263,5043,391,829,21.25,null,121,1808,null,1.9247135842880523,38.811603580286857,-3367.8097345132742,null,null,null,53.76991365681625,118.36283185840708,3.8637712702809655,11181.41592920354,6553,2399,17630,-15231,6394,9753,null,null,-14,255,1157,510,0,0,647,2,0,0,649,2127,1028,null,5,-592,-384,6394,5173,456,765,21.25,null,162.816176470588,8489,8657,9033,null,null,null,-522,97,109,-1632,480,214,-1675,119,144,0,50,0,792,0,1442,3953,2595,1358,1751,4145,1995,2150,1614,4995,1403,3592,1652,5075.0539956803459,4935.2557127312293,5577.4336283185839,243.43529411764706,134.64341488807912,null,null,null,null,null,874,-874]
[49,"Espoo",283632,null,3.2449869501559614,54.038286452969281,-198.77869915947423,null,null,null,72.125280713237885,2995.2649912562761,143.62561683821261,7611.9549275117051,641447,392012,1767910,-1375898,1501986,43067,null,null,6717,19657,195529,161134,0,0,34395,-1606,0,12468,45257,525559,133450,null,-5982,-54463,-72387,1501986,1259684,125298,117004,18,null,14,289731,null,1.2679828897455558,62.609942523908373,-612.43360220342322,null,null,null,68.239032484472602,3083.7259388881412,140.18050340554214,8029.3617182835114,672439,418078,1886234,-1455718,1521184,60874,null,null,6894,38178,171412,178942,0,0,-7530,-2232,0,15025,5263,511808,85823,null,-46854,-57850,-115870,1521184,1272287,128604,120293,18,null,16,292796,null,4.0479422010063217,70.48585348935822,-741.89879643164522,null,null,null,64.445278282607518,3875.7223459336874,167.76363908101936,8432.3317258432489,687990,416164,1942554,-1526390,1605340,205087,null,null,6090,14289,304416,175319,0,0,129097,-1232,0,15019,142884,637571,235436,null,-27450,-68170,-35607,1605340,1356824,136178,112338,18,null,26.823529411764699,819880,881701,918495,null,null,null,-306855,36316,64702,-351520,57414,92413,-424525,82341,71141,100000,-52872,220000,28508,285000,34749,798266,674452,123814,308687,988922,829753,159169,337799,1240501,1038677,201824,359897,12349.209539121113,13125.067735244071,14637.843413161383,75379.111111111109,257.44583638817164,null,null,null,null,null,55179,-55179]
[50,"Eura",11748,null,-0.23776662484316186,56.974627154754991,-3319.7991147429348,null,null,null,43.377877999718123,184.79741232550219,9.4616716417910443,7128.8729996595166,35905,10999,77829,-66830,43565,22881,null,null,-11,-19,-414,3515,0,0,-3929,23,0,0,-3906,3931,-790,null,879,-1559,-4362,43565,38473,1964,3128,20.5,null,263,11632,null,-8.052813909405844E-2,68.531737386423345,-4063.961485557084,null,null,null,35.611809271841743,175.37826685006877,8.4635757072871325,7563.3596973865197,35650,10626,78529,-67900,43287,24118,null,null,-38,10,-523,3726,0,0,-4249,21,0,0,-4228,-290,-627,null,-1212,-1279,-8289,43287,38036,2057,3194,20.5,null,244,11483,null,5.6436058700209646,61.102116476606128,-3832.6221370721937,null,null,null,38.998562361934148,295.91570147174082,14.746159699434061,7324.5667508490815,34910,10855,77313,-66458,45835,28546,null,null,-129,132,7926,4174,0,0,3752,20,0,0,3772,3482,7993,null,-511,-1281,2931,45835,40534,2487,2814,21,null,138.63970588235199,29661,30278,29917,null,900,null,-4158,75,511,-7966,7,297,-5340,13,265,0,4000,5080,6000,0,0,31082,11828,19254,3023,40882,15601,25281,2942,39601,14317,25284,2789,4619.1692202928152,5432.6856946354883,5253.5051815727602,1930.1904761904761,168.09113264743326,null,null,null,null,null,818,-818]
[51,"Eurajoki",9454,null,3.4361702127659575,34.307619956962277,259.25534165432623,null,null,null,79.677470120016892,2576.581341231225,124.06210755448888,7580.4950285593395,26361,8094,64344,-56250,50340,11737,null,null,-51,-724,5052,5212,0,0,-160,3,0,0,-157,75565,5052,null,1048,-1388,2484,50340,28914,2214,19212,18,null,38,9402,null,1.5512273827359686,31.894142633579253,562.32716443309937,null,null,null,80.063240168527415,2437.0346734737291,110.42774146695716,8055.2010210593489,27266,8388,70036,-61648,52060,11120,null,null,28,1770,3330,4915,0,0,-1585,3,-112,0,-1694,73816,3330,null,-3037,-1088,-773,52060,28952,2581,20527,18,null,71,9452,null,2.2490073737946683,30.311649935792104,552.15827338129498,null,null,null,80.760275272081273,2492.065171392298,109.45492622439497,8310.3046974185363,27445,7086,69110,-62024,51185,14150,null,null,-63,610,3858,4715,0,0,-857,3,166,0,-688,73022,3771,null,1586,-1656,180,51185,28776,2667,19742,18,null,255.492647058823,31318,35296,34270,null,null,null,-4044,16,1460,-4201,24,74,-7380,0,3789,0,-425,0,-442,0,0,13642,12023,1619,3622,12112,10456,1656,105,10455,8866,1589,0,1704.1463930611383,1570.7296319931929,1696.3605586119338,1598.6666666666667,169.13528001128512,null,null,null,null,null,701,-701]
[52,"Evijärvi",2473,null,{"$error":"#DIV/0!"},36.481064145550484,-57.015770319450063,null,null,null,65.704264728307834,2420.9462191670036,110.90975993503527,7967.2462596037203,4036,1829,18407,-16578,7975,8389,null,null,51,-293,-456,514,0,0,-970,0,0,0,-970,4177,-521,null,78,0,-1308,7975,6586,639,750,21.5,null,284,2425,null,-0.25462690086054462,48.008149697067182,-688.65979381443299,null,null,null,57.20260443895252,2752.5773195876291,115.85786295116269,8671.7525773195885,4135,1744,19558,-17814,8047,8860,null,null,58,579,-270,619,0,0,-889,0,0,0,-889,3287,-275,null,-101,0,-1492,8047,6699,584,764,21.5,null,262,2408,null,296,54.415016713808178,-1184.8006644518273,null,null,null,52.149061613934023,3031.1461794019933,124.02285740887295,8920.6810631229237,4217,1630,19394,-17764,8100,9715,null,null,69,175,295,744,0,0,-449,0,0,0,-449,2838,295,null,181,0,-1230,8100,6733,674,693,21.5,null,287.72794117646998,12714,13692,13237,null,null,null,-956,75,94,-1384,160,7,-1591,61,5,0,550,0,1000,0,3200,5500,0,5500,194,6500,0,6500,187,9700,0,9700,180,3319.8544278204613,3919.5876288659792,5443.5215946843855,313.16279069767444,130.05099281464885,null,null,null,null,null,500,-500]
{"$rows_left_out":282}