{"text_format":"1","workbook":"xlsx","n_sheets":2,"sheets":["Kuntakortti","Luvut"],"not_rendered":{"charts":0,"images":0,"macros":1,"external_links":0,"defined_names":2,"comments":0,"pivot_tables":0},"unopened":[],"bounds":{"document_bytes":16777216,"sheet_cells":100000,"rows_first":2000,"rows_last":500,"rows_between":2000,"halvings":0,"cell_chars":16384,"cell_head_chars":4096},"cells_cut":0,"cells_raw":0,"read":"whole","date_system":"1900"}

{"sheet":"Kuntakortti","index":0,"n_rows":79,"n_cols":16,"rows_kept":79,"cut":false,"hidden":false,"merged":[[1,6,1,7]]}
["Valtiovarainministeriö/Kunta- ja aluehallinto-osasto, 9.6.2018"]
["KUNTIEN LOPULLISET TP:T 2015-2016 ja TPennakko 2017",null,null,null,null,null,"Valitse kunta valikosta:"]
[null,null,null,null,null,null,null," "]
[{"$f":"INDEX(Luvut!$B$3:'Luvut'!$B$298,$A$7)","v":"KOKO MAA (Manner-Suomi)"},null,null,2015,null,null,2016,null,null,2017]
[]
["Asukasluku",null,null,{"$f":"VLOOKUP($A$4,Luvut!$B$3:$AT$298,2)","v":5458325},null,null,{"$f":"VLOOKUP($A$4,Luvut!$B$3:$ED$298,46)","v":5474083}," ",{"$f":"((G6/D6)-1)*100","v":0.28869662396431295},{"$f":"VLOOKUP($A$4,Luvut!$B$3:$ED$298,90)","v":5483641}," ",{"$f":"((J6/G6)-1)*100","v":0.17460458674083412}]
[96,null,null," "]
["Tunnuslukuja",null,null," "]
[null,null,null," "," "," "," ",null,"muut.%"," ",null,"muut.%",null,"Konsernivelka, €","Konsernivelka, €","Konsernivelka, €"]
["Lainat, euro/as",null,null,{"$f":"E67","v":2840.5019854992147}," ",null,{"$f":"H67","v":2939.1072440808807},null,{"$f":"((G10/D10)-1)*100","v":3.4714025578945762},{"$f":"K67","v":2940.6757298663424},null,{"$f":"((J10/G10)-1)*100","v":5.3366061705317769E-2},null,2015,2016,2017]
["Konsernilainat, euro/as",null,null,{"$f":"VLOOKUP($A$4,Luvut!$B$3:$FM$298,167)","v":5987},null,null,{"$f":"VLOOKUP($A$4,Luvut!$B$3:$FM$298,168)","v":6157.9717888925734},null,{"$f":"((G11/D11)-1)*100","v":2.8557172021475452},{"$f":"VLOOKUP($A$4,Luvut!$B$3:$FN$298,169)","v":6314.2279007688503},null,{"$f":"((J11/G11)-1)*100","v":2.5374606645344411},null,{"$f":"D11*D6","v":32678991775},{"$f":"G11*G6","v":33709248684.056423},{"$f":"J11*J6","v":34624959000}]
["Lainanhoitokate",null,null,{"$f":"VLOOKUP($A$4,Luvut!$B$3:$AT$298,4)","v":1.06}," ",null,{"$f":"VLOOKUP($A$4,Luvut!$B$3:$ED$298,48)","v":1.3845192262264607},null,null,{"$f":"VLOOKUP($A$4,Luvut!$B$3:$ED$298,92)","v":1.84}]
["Suhteellinen velkaantuneisuus, %",null,null,{"$f":"VLOOKUP($A$4,Luvut!$B$3:$AT$298,5)","v":54.9}," ",null,{"$f":"VLOOKUP($A$4,Luvut!$B$3:$ED$298,49)","v":55.694527011770546},null,null,{"$f":"VLOOKUP($A$4,Luvut!$B$3:$ED$298,93)","v":56.230046087942604}]
["Rahoitusvarallisuus, euro/as",null,null,{"$f":"VLOOKUP($A$4,Luvut!$B$3:$AT$298,6)","v":-2611.6389185327002}," ",null,{"$f":"VLOOKUP($A$4,Luvut!$B$3:$ED$298,50)","v":-2634.5813536258038},null,null,{"$f":"VLOOKUP($A$4,Luvut!$B$3:$ED$298,94)","v":-2554.7153797996621}]
["Omavaraisuusaste, %",null,null,{"$f":"VLOOKUP($A$4,Luvut!$B$3:$AT$298,10)","v":60.17},null,null,{"$f":"VLOOKUP($A$4,Luvut!$B$3:$ED$298,54)","v":59.790257761132146},null,null,{"$f":"VLOOKUP($A$4,Luvut!$B$3:$ED$298,98)","v":60.7}]
{"$rows_left_out":65}
{"sheet":"Luvut","index":1,"n_rows":298,"n_cols":179,"rows_kept":298,"cut":false,"hidden":false,"merged":[]}
[null,null,2015,"hakee muualta",92,93,94,"vanha",96,97,98,99,100,101,102,103,104,105,106,107,108,"summana",110,111,112,113,114,115,116,117,118,119,120,121,122,"kaavasta",124,125,126,127,128,129,130,131,"kaavasta",133,2016,"hakee muualta",92,93,94,"vanha",96,97,98,99,100,101,102,103,104,105,106,107,108,"summana",110,111,112,113,114,115,116,117,118,119,120,121,122,"kaavasta",124,125,126,127,128,129,130,131,"kaavasta",133,2017,"hakee muualta",92,93,94,"vanha",96,97,98,99,100,101,102,103,104,105,106,107,108,"summana",110,111,112,113,114,115,116,117,118,119,120,121,122,"kaavasta",124,125,126,127,128,129,130,131,"kaavasta",133,"Erillistiedot",135,136,137,138,139,2015,144,145,2016,147,148,2017,147,148,2015,152,2016,154,2017,null,2015,160,161,162,2016,164,165,166,2017,164,165,166,2015,2016,2017,"Yhden vero%:n","Yhden vero%:n",null,null,"Nettoinv."]
["Kunta nro","Kunta","Asukasluku ","Lainat e/asukas","Lainanhoitokate","Suhteellinen velkaantuneisuus-%","Rahoitusvarallisuus, e/as","Vuosikate","Suunnitelman mukaiset poistot","Tilikauden tulos","Omavaraisuusaste, %","Rahavarat e/as","Kassan riittävyys, pv","Kassasta maksut, €/as","Henkilöstökulut","Toimintatuotot","Toimintakulut","Toimintakate","Verotulot","Valtionosuudet","Alv-takaisinperintä","Käyttökate","Korkotuotot/-menot, netto","Muut rahoitustuotot/-menot, netto (sis Osinkotuotot)","Vuosikate","Suunnitelman mukaiset poistot ja arvonalet","Satunnaiset tuotot","Satunnaiset kulut","Tilikauden tulos","Poistoeron lisäys(-) tai vähennys(+)","Varausten lisäys(-) tai vähennys(+)","Rahastojen lisäys(-) tai vähennys(+)","Tilikauden yli- tai alijäämä","Kumulat yli/alij","Tulorah (toiminnan rahavirta)","Investoinnit, netto","Saamisten muutos (ent Pitkäaikaisten saamisten muutokset, netto)","Pitkäaikaisten lainojen vähennys","Toim ja inv rahavirta","Verotulot","Kunnallisvero","Osuus yhteisöveron tuotosta","Kiinteistövero","Tuloveroprosentti 2013","Yhden veroprosentin tuotto 2012","Sijoitus vuosikatteen mukaan","Asukasluku ","Lainat e/asukas","Lainanhoitokate","Suhteellinen velkaantuneisuus-%","Rahoitusvarallisuus, e/as","Vuosikate","Suunnitelman mukaiset poistot","Tilikauden tulos","Omavaraisuusaste, %","Rahavarat e/as","Kassan riittävyys, pv","Kassasta maksut, €/as","Henkilöstökulut","Toimintatuotot","Toimintakulut","Toimintakate","Verotulot","Valtionosuudet","Alv-takaisinperintä","Käyttökate","Korkotuotot/-menot, netto","Muut rahoitustuotot/-menot, netto (sis Osinkotuotot)","Vuosikate","Suunnitelman mukaiset poistot ja arvonalet","Satu. tuotot","Satu. kulut","Tilikauden tulos","Poistoeron lisäys(-) tai vähennys(+)","Varausten lisäys(-) tai vähennys(+)","Rahastojen lisäys(-) tai vähennys(+)","Tilikauden yli- tai alijäämä","Kumulat yli/alij","Tulorah (toiminnan rahavirta)","Investoinnit, netto","Saamisten muutos (ent Pitkäaikaisten saamisten muutokset, netto)","Pitkäaikaisten lainojen vähennys","Toim ja inv rahavirta","Verotulot","Kunnallisvero","Osuus yhteisöveron tuotosta","Kiinteistövero","Tuloveroprosentti 2014","Yhden veroprosentin tuotto 2013","Sijoitus vuosikatteen mukaan","Asukasluku","Lainat e/asukas","Lainanhoitokate","Suhteellinen velkaantuneisuus-%","Rahoitusvarallisuus, e/as","Vuosikate","Suunnitelman mukaiset poistot","Tilikauden tulos","Omavaraisuusaste, %","Rahavarat e/as","Kassan riittävyys, pv","Kassasta maksut, €/as","Henkilöstökulut","Toimintatuotot","Toimintakulut","Toimintakate","Verotulot","Valtionosuudet","Alv-takaisinperintä","Käyttökate","Korkotuotot/-menot, netto","Muut rahoitustuotot/-menot, netto (sis Osinkotuotot)","Vuosikate","Suunnitelman mukaiset poistot ja arvonalet","Satu. tuotot","Satu. kulut","Tilikauden tulos","Poistoeron lisäys(-) tai vähennys(+)","Varausten lisäys(-) tai vähennys(+)","Rahastojen lisäys(-) tai vähennys(+)","Tilikauden yli- tai alijäämä","Kumulat yli/alij","Toiminnan rahavirta","Investoinnit, netto","Saamisten muutos ","Pitkäaikaisten lainojen vähennys","Toim ja inv rahavirta","Verotulot","Kunnallisvero","Osuus yhteisöveron tuotosta","Kiinteistövero","Tuloveroprosentti 2016","Yhden veroprosentin tuotto 2006","Sijoitus vuosikatteen mukaan","Palvelujen ostot 2015","Palvelujen ostot 2016","Palvelujen ostot 2017","Harkvar2015","Harkvar2016","Harkvar2017"," - Investointimenot"," + Rahoitusos. investointimenoihin"," + Investointihyödykk. luovutustulot"," - Investointimenot"," + Rahoitusosuudet investointimenoihin"," + Investointihyödykkeiden luovutustulot"," - Investointimenot"," + Rahoitusosuudet investointimenoihin"," + Investointihyödykkeiden luovutustulot","Pitkäaikaisten lainojen lisäys"," ± Lyhytaikaisten lainojen muutos","Pitkäaikaisten lainojen lisäys"," ± Lyhytaikaisten lainojen muutos","Pitkäaikaisten lainojen lisäys"," ± Lyhytaikaisten lainojen muutos","Lainakanta","josta pitkäaik","josta lyhytaik","Lainasaamiset","Lainakanta","josta pitkäaik","josta lyhytaik","Lainasaamiset","Lainakanta","josta pitkäaik","josta lyhytaik","Lainasaamiset","Konsernilainat €/as","Konsernilainat €/as","Konsernilainat €/as","tuotto","tuotto, €/as",null,null,2015]
[20,"Akaa",17043,null,0.24972421400992831,66,-3907.1759666725343,null,null,null,25,117.46758199847444,5.5798379645537919,7684.0345009681396,47398,22841,110377,-87536,59092,29881,null,null,-218,40,1229,4203,0,0,-2974,31,0,0,-2943,-8186,758,null,790,-12000,-6593,59092,54123,1775,3194,21.25,null,277,16923,null,0.73550271172298709,62.860961626393724,-3766.7080304910478,null,null,null,25.642957397622194,245.81929917863263,12.783942613703335,7018.4955386160846,46980,22328,109001,-86670,60148,31248,null,null,-163,204,4767,4712,0,0,55,29,0,0,84,-8105,4602,null,1344,-6669,2675,60148,55165,1606,3377,21.25,null,219,16769,null,1.0088908981314044,59.665482401582203,-3534.3192796231142,null,null,null,28.362223872085391,209.43407478084561,11.160854991075704,6849.2456318206214,45491,21856,106289,-84433,59399,30488,null,null,-111,865,6208,4695,0,0,1513,28,0,0,1541,-6564,5413,null,-310,0,4429,59399,54017,1893,3489,21.25,null,213,47031,46809,47917,null,null,null,-8431,341,739,-2583,394,262,-1929,95,850,6670,2418,5427,-908,6149,987,59953,43679,16274,7333,57802,42557,15245,7333,52640,36938,15702,7219,4111,4161.6734621521009,3927.7237760152661,{"$f":"(DY3/EB3)","v":2541.9764705882353},{"$f":"(FO3/CM3)*1000","v":151.58783890442098},null,null,-7467,null,null,4670,{"$f":"FV3*-1","v":-4670}]
[5,"Alajärvi",10006,null,1.1717791411042944,33,-2771.6370177893264,null,null,null,41,396.66200279832105,14.628010299389105,9897.561463122127,41443,41661,98986,-57325,28454,34084,null,null,-315,199,5024,3095,0,0,1929,0,0,0,1929,-2000,4948,null,593,-2000,3254,28454,24150,2048,2256,21.5,null,72,9899,null,2.4633738964447627,28.221488612089772,-2140.9233255884433,null,null,null,50.275229357798167,432.77098696838061,14.539993676889027,10863.92564905546,40424,41840,98036,-56196,29436,36984,null,null,-254,84,10054,3035,0,0,7019,0,0,0,7019,5020,9909,null,-1787,-3921,6412,29436,25084,2039,2313,22,null,8,9831,null,1.8237333333333334,34.971089100538052,-2238.9380530973453,null,null,null,51.307713818936463,440.54521411860441,15.815583324162358,10167.12440240057,40714,29143,87940,-58797,29659,35799,null,null,-193,158,6626,3001,0,0,3625,0,0,0,3625,8644,6523,null,-1698,-4000,-916,29659,25065,2438,2156,21.75,null,61,49220,49110,36649,null,null,null,-2072,276,102,-5261,134,1630,-8254,647,168,4240,null,0,-1500,3537,2000,24115,18694,5421,551,18695,15158,3537,465,21157,15626,5531,458,4146,3901.4041822406302,4235.0727291221638,1152.4137931034484,117.22243852135576,null,null,-1776,null,null,3040,-3040]
[9,"Alavieska",2687,null,1.531868131868132,68,-3979.531075548939,null,null,null,33,460.73688128023821,26.633855947188493,6314.1049497580943,3525,2108,17064,-14956,7792,8552,null,null,-58,6,1336,795,0,0,541,0,0,0,541,-1422,1336,null,213,0,763,7792,7099,285,408,21.5,null,74,2639,null,1.8188874514877102,62.400555288589885,-3384.2364532019706,null,null,null,38.436550351042648,328.15460401667298,16.914967624551828,7081.0913224706328,4143,2175,17327,-15152,7685,8869,null,null,-49,4,1357,811,681,0,1227,0,0,0,1227,-195,2041,null,-1232,-724,1736,7685,6892,271,522,21.5,null,85,2610,null,1.1881804043545878,60.200468486136081,-3405.7471264367819,null,null,null,39.585611196151326,345.21072796934868,17.207251988279616,7322.605363984675,4205,2156,17600,-15444,7284,8917,null,null,-43,7,721,817,0,0,-96,0,0,0,-96,-290,721,null,629,0,51,7284,6494,285,505,21.5,null,256,12293,11578,11750,null,null,null,-650,72,5,-576,6,265,-859,189,0,852,500,0,0,600,-2000,11124,5479,5645,84,10399,4800,5599,84,7801,4308,3493,84,4857,4106.8586585827961,3182.3754789272034,302.04651162790697,115.72663280762718,null,null,-575,null,null,792,-792]
[10,"Alavus",12050,null,0.36828593996840442,52,-2476.1825726141078,null,null,null,50,927.13692946058086,42.450785454772586,7971.7012448132773,34642,15659,86214,-70555,34015,37398,null,null,-7,1308,1584,2982,0,0,-1398,0,0,0,-1398,11384,1475,null,-68,-6000,-3203,34015,29182,2245,2588,20.75,null,264,11907,null,0.45826545280306658,53.733373994229282,-2456.9580918787265,null,null,null,50.130236362853573,1066.0955740320819,47.039157757946782,8272.3607961703201,23869,11906,81749,-69628,34482,38870,null,null,5,938,4667,3133,0,0,1534,0,0,0,1534,12918,4405,null,390,-10320,900,34482,29668,2203,2611,21.25,null,147,11713,null,0.95463642428285522,53.389356395253969,-2373.9434816016392,null,null,null,51.593063437212692,1244.8561427473746,57.187150777959253,7945.3598565696229,23076,12152,81802,-69650,35218,38629,null,null,-66,1332,5463,3217,0,0,2246,0,0,0,2246,15165,5428,null,338,-6760,1987,35218,29789,2699,2730,21.25,null,167,41589,51031,51412,null,null,null,-5241,185,378,-5693,285,1903,-4099,258,400,4783,1800,14200,700,5735,-1000,34138,26718,7420,7869,38719,31130,7589,8137,38742,32437,6305,8634,5039,5864.1975308641977,6004.1833859813887,1401.835294117647,119.6820024005504,null,null,-4697,null,null,2706,-2706]
[16,"Asikkala",8287,null,33.657657657657658,38,-2145.5291420296853,null,null,null,61,78.918788463859059,5.0518496571573692,5701.942801979003,13159,6847,49270,-42423,29378,16868,null,null,-78,-63,3654,2039,0,0,1615,94,0,0,1709,9156,3294,null,-129,0,2402,29378,25339,1538,2501,20.75,null,102,8323,null,67.654320987654316,33.603082851637765,-1769.1938003123873,null,null,null,65.710919088766687,38.687973086627423,2.2587154552792406,6251.832272017301,13727,6664,48906,-42238,29925,17906,null,null,-50,-115,5428,2164,0,0,3264,94,-2000,0,1358,10514,5331,null,-1284,-29,3076,29925,25836,1430,2659,20.75,null,42,8248,null,70.661764705882348,28.39358480690867,-1464.8399612027158,null,null,null,79.269648507654153,120.51406401551891,7.0218119181714371,6264.4277400581959,13221,6285,48775,-42490,29701,17513,null,null,-41,80,4763,2353,0,0,2410,94,-2400,0,104,10152,4310,null,1152,0,2623,29701,25298,1616,2787,20.75,null,95,32577,31541,31830,null,null,null,-1540,113,535,-2644,178,211,-2633,190,756,29,-7000,0,-2000,26,-3000,17046,1480,15566,832,15016,1474,13542,817,11990,1469,10521,807,3833,3418.1184668989549,3014.4277400581959,1219.1807228915663,147.81531557851193,null,null,-1895,null,null,380,-380]
[18,"Askola",5104,null,0.45089757127771912,65,-3262.3432601880882,null,null,null,27,254.1144200626959,14.117164668694459,6570.1410658307204,12949,4397,29519,-25122,18430,6844,null,null,-137,488,290,1103,0,0,-813,0,0,0,-813,-569,157,null,517,-1300,-2207,18430,16391,987,1052,20.25,null,282,5046,null,1.1625258799171843,63.322058153906198,-3389.0210067380103,null,null,null,25.534617827651918,235.83036068172811,13.412073490813649,6417.9548156956007,13037,4436,29873,-25437,19174,7136,null,null,-140,250,983,1213,0,0,-230,0,0,0,-230,-799,830,null,47,-826,-460,19174,17262,868,1044,20.25,null,245,4990,null,0.93658536585365859,74.174605245987209,-3914.4288577154307,null,null,null,25.864092865527585,345.49098196392788,18.3302746948644,6879.5591182364724,12945,4571,29968,-25397,18756,7325,null,null,-131,276,829,1338,0,0,-509,0,0,0,-509,-1309,644,null,-300,-2000,-2389,18756,16579,1038,1139,20.75,null,279,12710,12983,13213,null,null,null,-2542,21,157,-1534,0,244,-3320,6,281,810,2198,2692,-1514,894,1751,16221,9650,6571,0,16573,11381,5192,0,19431,11811,7620,0,4215,4299.8414585810551,4928.6573146292585,798.98795180722891,160.11782601347272,null,null,-2484,null,null,699,-699]
[19,"Aura",3986,null,0.89258312020460362,74,-3805.0677370797794,null,null,null,12,123.93376818866031,7.8569872325591525,5757.400903161064,7090,3226,21799,-18573,13875,5377,null,null,-64,22,634,784,0,0,-150,28,0,0,-122,-2956,452,null,243,0,-1098,13875,12633,506,736,21,null,257,3984,null,2.3382352941176472,64.000849437247822,-3546.1847389558234,null,null,null,17.363100708146387,92.620481927710841,5.7874269508422147,5841.3654618473893,6754,3073,21803,-18730,14440,6032,null,null,-34,7,1715,724,0,0,991,28,0,0,1019,-1937,1708,null,313,-714,1030,14440,13272,758,410,21.75,null,124,3991,null,3.8417462482946796,58.264376897168283,-2959.4086695063893,null,null,null,28.100125680770841,361.81408168378852,23.191938748569921,5694.312202455525,6178,3192,21251,-18059,14873,5984,null,null,-19,18,2797,752,0,0,2045,28,0,0,2073,136,2830,null,-185,0,2215,14873,13597,745,531,21.75,null,51,12248,12576,12654,null,null,null,-1867,75,242,-719,0,41,-739,0,124,718,2000,0,-590,714,-590,14585,3691,10894,0,13280,2976,10304,0,11976,2262,9714,0,5419,4090.3614457831327,3702.0796792783767,625.14942528735628,156.63979586252978,null,null,-1321,null,null,607,-607]
[46,"Enonkoski",1473,null,1.4486754966887416,11,1194.8404616429057,null,null,null,89,1955.193482688391,99.451277199621586,7175.831636116769,4521,2147,11278,-9131,4825,5096,null,null,21,119,871,511,48,0,408,0,0,0,408,5216,861,null,28,0,425,4825,3801,606,418,21,null,47,1453,null,{"$error":"#DIV/0!"},7.1887034659820284,1571.9201651754991,null,null,null,92.633120799586422,1956.6414315209911,91.904614294570905,7770.8189951823815,3278,1914,10626,-8712,4544,5227,null,null,21,20,1100,510,0,65,525,0,0,0,525,5742,1034,null,-109,0,462,4544,3570,550,424,21,null,26,1416,null,{"$error":"#DIV/0!"},10.119047619047619,1542.3728813559323,null,null,null,90.589384565288185,1900.4237288135594,79.854878048780492,8686.4406779661022,2388,1299,10844,-9545,4853,5272,null,null,26,40,646,513,294,50,377,0,0,0,377,6119,597,null,-367,0,-156,4853,3723,595,535,21,null,174,5199,5932,7520,null,null,null,-497,0,61,-665,65,28,-1453,3,697,600,-80,0,0,0,0,0,0,0,489,0,0,0,407,0,0,0,346,999,801.10116999311765,766.24293785310738,177.28571428571428,125.20177562550444,null,null,-498,null,null,63,-63]
[47,"Enontekiö",1861,null,0.443359375,42,-3372.3804406233207,null,null,null,47,171.95056421278881,5.8037267080745343,10814.078452444923,6877,2594,17332,-14738,6023,8833,null,null,-93,336,361,484,0,0,-123,0,0,0,-123,245,361,null,46,-1970,-472,6023,4863,338,822,20.75,null,239,1872,null,0.8007033997655334,39.205927266557325,-3087.0726495726494,null,null,null,49.133186571271324,113.78205128205128,3.9320756625531055,10561.965811965812,7098,2595,17380,-14785,6151,8935,null,null,1,299,601,382,0,0,219,0,0,0,219,464,601,null,-193,-771,340,6151,5003,326,822,21.25,null,196,1893,null,1.8098802395209581,36.63907191530101,-2693.0797675647123,null,null,null,54.972662467990865,238.2461701003698,8.1219163212946519,10706.814580031694,6594,2730,16897,-14167,6203,8824,null,null,-60,349,1149,348,0,0,801,0,0,0,801,1265,1149,null,-17,0,777,6203,4963,410,830,21.25,null,77,8321,8141,8260,null,null,null,-934,101,0,-1267,1000,6,-2514,2142,0,931,-653,0,440,608,-363,5812,4581,1231,1682,5481,3810,1671,1682,4511,3203,1308,1666,6451,6236.6452991452988,5492.3402007395671,233.5529411764706,123.37714800658773,null,null,-833,null,null,874,-874]
[49,"Espoo",269800,null,2.8346794278801681,49,67.813194959229065,null,null,null,75,2710.8747220163086,123.14575233828513,8034.9444032616757,631945,405147,1718159,-1313012,1393802,30083,null,null,10858,35309,154834,126686,0,0,28148,-30876,0,40102,37374,397468,120723,null,2947,-269272,-147671,1393802,1161281,136157,96364,18,null,49,274583,null,3.0600716124641196,59.640133706552163,-91.1782593969765,null,null,null,70.133055871697181,3274.5144455410568,162.01156262835298,7377.2374837480838,633118,332453,1735458,-1336350,1446482,60915,null,null,7554,20369,198970,138944,0,0,60026,12328,0,71,72425,469893,161398,null,-40873,-59738,-46438,1446482,1226153,120589,99740,18,null,30,279044,null,3.6269561518125739,57.076201503058414,91.8887343931423,null,null,null,75.664349573656935,3413.5046802654779,169.63562909092681,7344.7377474520144,619229,336891,1679858,-1342967,1490270,36400,null,null,7246,39974,230923,144454,0,0,86469,11874,0,-41,98302,487912,204136,null,44571,-30000,-29967,1490270,1236961,137156,116153,18,null,28,781379,792901,769017,null,null,null,-358407,42985,47028,-286430,30125,48469,-308439,42229,32107,51703,42360,270000,31369,58022,-23582,615573,446609,168964,364890,857204,655965,201239,363246,805600,632921,172679,290265,10000,11605.518185758039,12290.817935522715,68720.055555555562,246.26960463423532,null,null,-262144,null,null,55179,-55179]
[50,"Eura",12128,null,1.6308630393996248,49,-2818.024406332454,null,null,null,48,118.56860158311346,6.0400699670878506,7165.0725593667548,35543,11873,77842,-65969,45291,24045,null,null,-260,114,3195,3302,0,0,-107,28,0,0,-79,5717,2951,null,-283,-6329,-3210,45291,40489,2540,2262,20.5,null,199,12004,null,1.6334991708126037,50.625802714749803,-2945.0183272242584,null,null,null,47.336620326170831,132.70576474508496,6.9803834471829722,6939.1036321226256,35792,11379,75558,-64179,43653,24386,null,null,-250,45,3655,3174,0,0,481,26,0,0,507,6223,3506,null,560,-2127,-1471,43653,38341,2183,3129,20.5,null,207,11910,null,2.6784049715173484,50.811830240051954,-2931.9059613769941,null,null,null,48.275773953262551,162.38455079764904,8.5624006889608584,6922.166246851385,34664,11832,74927,-63095,44397,23837,null,null,-10,-4,5125,3535,0,0,1590,24,0,0,1614,7837,4653,null,-569,0,72,44397,39017,2303,3077,20.5,null,186,30966,28631,28965,null,null,null,-7095,640,294,-5319,56,286,-5390,164,645,1850,-2600,219,4200,1884,1600,26631,16295,10336,3883,28923,14628,14295,3568,28641,13067,15574,3280,4394,4501.4161946017994,4408.5642317380352,1903.2682926829268,159.80422272736581,null,null,-6376,null,null,818,-818]
[51,"Eurajoki",5938,null,14.531390134529149,24,2284.6076119905692,null,null,null,88,3639.6092960592796,176.59234385493619,7522.7349275850447,18564,5310,42891,-37581,34546,8207,null,null,192,1096,6454,3314,0,0,3140,2,0,0,3142,69938,6264,null,-1563,0,-1866,34546,16365,2179,16002,18,null,3,6070,null,6.5469356089992239,21.589969423664929,2324.2174629324545,null,null,null,88.569825461395112,3835.9143327841844,155.7415382359948,8989.9505766062593,18467,5351,44449,-39098,38041,8609,null,null,131,728,8411,3845,0,0,4566,2,0,0,4568,74506,8382,null,1283,-1261,1802,38041,18489,1426,18126,18,null,2,9521,null,6.4026402640264024,35.061224489795919,-15.859678605188529,null,null,null,78.926804495265557,2353.3242306480411,111.00962386827925,7737.7376326016174,26887,8230,64721,-56491,51919,13351,null,null,-16,820,9583,4906,0,0,4677,5,0,0,4682,75721,9583,null,-532,0,3557,51919,51919,0,0,18,null,11,20205,21605,30985,null,null,null,-8648,0,518,-6785,0,205,-6535,20,489,419,846,0,0,1398,-422,3826,2565,1261,2049,2565,2143,422,3298,15454,13759,1695,3779,950,608.56672158154856,1842.7686167419388,2884.3888888888887,302.95020364340814,null,null,-7328,null,null,701,-701]
[52,"Evijärvi",2576,null,2.0078125,28,448.75776397515529,null,null,null,72,2312.8881987577643,120.79486752207966,6988.7422360248447,3951,1851,18133,-16282,8877,7848,null,null,37,12,492,409,0,0,83,0,0,0,83,4866,485,null,19,0,-70,8877,7048,1099,730,21.5,null,243,2535,null,2.8166666666666669,28.896103896103895,319.52662721893495,null,null,null,71.414394651624363,2258.3826429980277,108.71007179273749,7582.6429980276134,3949,1780,18175,-16395,8615,8085,null,null,193,4,502,444,0,0,58,0,0,0,58,4924,502,null,-9,-175,-333,8615,6961,933,721,21.5,null,242,2499,null,718,32.495003331112592,466.18647458983594,null,null,null,70.363056357283909,2573.4293717486994,128.65524801315431,7300.9203681472591,3890,1678,17797,-16119,8224,8110,null,null,95,407,717,494,0,0,223,0,0,0,223,5147,717,null,-162,0,366,8224,6674,827,723,21.5,null,251,12858,12869,12449,null,null,null,-574,0,19,-853,9,9,-424,51,22,234,-500,0,500,0,950,3675,0,3675,214,4000,0,4000,207,4950,0,4950,201,2290,2449.7041420118344,2915.1660664265705,310.41860465116281,124.2171287119499,null,null,-540,null,null,500,-500]
{"$rows_left_out":283}